program: Gaussian 09
title: 000128064
version: EM64L-G09RevD.01
frameworkgroup: C1[X(C16H14ClN3O)]
method: RPBEPBE
basis: SDD
operation: Freq
keyword: #p
keyword: freq=noraman
keyword: PBEPBE/SDD
title: #p freq=noraman PBEPBE/SDD
converged: NO YES NO NO
title: Mulliken charges:
elementType: Cl O N N N C C C C C C C C C C C C C C C C H H H H H H H H H H H H H H
charge: -0.055264 -0.242623 -0.361742 -0.266843 -0.020274 0.269668 -0.546968 -0.413487 -0.408262 -0.463015 -0.048544 0.170356 0.106617 0.095623 -0.483417 0.453416 -0.334320 -0.398533 -0.203086 -0.184324 -0.121343 0.229604 0.225317 0.213883 0.213515 0.207552 0.216316 0.248089 0.235204 0.315536 0.274216 0.308252 0.254161 0.258541 0.256180
chargesum: 0.00000
title: Mulliken charges with hydrogens summed into heavy atoms:
elementType: Cl O N N N C C C C C C C C C C C C C C C C
charge: -0.055264 -0.242623 -0.046206 -0.266843 -0.020274 0.269668 -0.092047 0.013910 0.015606 0.020278 -0.048544 0.170356 0.106617 0.095623 -0.209202 0.453416 -0.026068 -0.144372 0.055456 0.071856 -0.121343
polarizability: 3.59357466e+02 -1.19782096e+01 2.08659203e+02 2.69398384e+00 3.40351843e+00 9.73071797e+01
1716.lowfreq: -8.1217 -4.1966 -1.6724 -0.0008 0.0004 0.0015 29.5025 44.0168 62.6578
frequency: 29.4946 43.9497 62.6521 75.8516 91.6399 124.8926 140.4961 173.5598 220.2792 231.5323 265.3989 286.1612 291.7030 312.0024 322.1757 361.1676 389.0157 410.6233 416.2409 427.1200 475.7525 494.8648 503.7194 516.8258 535.4787 570.7141 604.7148 621.4427 637.9653 669.1916 684.7256 697.7023 715.8810 756.7848 764.8588 806.9009 815.1324 830.5165 833.4630 858.8079 884.3907 902.5059 938.5968 939.0456 944.8775 967.2457 979.8604 992.2236 1039.9026 1076.0885 1081.5861 1092.3238 1098.6260 1109.2742 1132.8071 1144.3300 1151.5815 1188.5372 1191.7622 1235.5858 1241.8842 1267.7476 1286.4242 1298.9723 1302.7854 1331.1442 1333.2743 1340.5201 1349.7638 1355.3014 1365.7854 1396.1516 1411.3949 1426.7388 1437.2127 1455.2937 1468.1844 1472.2526 1476.6326 1483.6217 1575.0103 1580.6890 1604.4537 1610.0063 1642.2502 2944.6075 2977.8787 2982.9529 2985.0225 3003.0371 3046.8068 3049.8057 3057.5024 3148.5454 3154.8720 3168.4811 3177.0437 3193.0520 3477.0441
redmass: 6.5094 3.7638 6.3680 4.1473 4.3382 3.9532 3.9203 6.9632 7.7085 6.9413 7.2244 2.8160 3.4996 3.4829 4.0598 5.0108 4.4322 3.0488 5.3339 3.8459 3.1384 3.4201 2.8828 2.3077 2.5384 5.1500 5.7532 6.5337 3.9821 7.3660 6.4931 4.1304 5.2626 4.8409 3.6937 3.9553 1.4779 1.7581 1.4464 2.8797 2.4681 1.5706 1.4533 1.4048 3.2478 1.3356 2.6372 4.4818 4.4696 2.4651 1.9433 2.1813 2.5326 1.8985 1.1700 2.5417 1.8901 1.5869 1.5494 1.9735 1.3298 1.2463 1.7964 1.6302 2.1425 1.8565 2.1873 1.6458 1.7346 2.1108 3.8097 2.5095 3.2376 2.3185 3.1973 1.1373 1.3675 1.1207 1.1503 2.5434 8.1768 8.0056 6.2795 8.1206 12.1544 1.0624 1.0677 1.0662 1.0665 1.0884 1.0940 1.0989 1.1025 1.0929 1.0882 1.0907 1.0966 1.0963 1.0788
irintensity: 0.9001 0.5264 0.7215 1.0433 0.8779 0.4083 0.2784 0.9772 2.4810 2.9345 1.3664 2.8945 1.7764 0.8433 6.2290 9.2308 10.4836 3.2090 14.8424 4.3134 39.0651 3.1403 51.8268 54.8970 63.4501 6.0824 24.7596 1.3933 11.3208 4.1665 2.7929 0.0797 2.0331 4.9541 8.4571 38.1315 21.6732 9.3565 59.3181 4.7453 10.2824 2.9557 8.1516 5.2016 23.7368 1.9133 5.6151 21.7091 59.0732 35.9500 0.1032 0.4945 21.0377 30.0750 0.1934 44.4371 3.8488 18.2606 13.0760 4.0932 4.8956 0.9223 29.4683 9.8670 72.0160 23.2719 15.9332 6.8892 29.7786 36.9712 6.4757 22.0385 10.2914 24.3435 17.0795 32.5765 14.4128 11.5830 26.2962 341.1479 89.9898 2.5769 21.1113 108.8700 290.6704 24.1682 12.0274 40.3740 15.7342 40.5754 44.9886 42.8898 49.2069 4.3741 6.7682 2.2984 2.2955 4.9183 17.8772
temp: 298.150 k
press: 1.00000 atm
elementType: 17 8 7 7 7 6 6 6 6 6 6 6 6 6 6 6 6 6 6 6 6 1 1 1 1 1 1 1 1 1 1 1 1 1 1
symmnumber: 1
zpe: 706052.1 jmol-1
zpe.correction: 0.268921 hartree
zpe.thermalcorrener: 0.286049 hartree
zpe.thermalcorrenthalpy: 0.286993 hartree
zpe.thermalcorrgfe: 0.223046 hartree
zpe.sumelectzpe: -1316.166171 hartree
zpe.sumelectthermal: -1316.149043 hartree
zpe.sumelectthermalent: -1316.148099 hartree
zpe.sumelectthermalfe: -1316.212046 hartree
dipole: -2.6678 -5.7642 1.2446
dipole: 6.4724
quadrupole: -137.2856 -131.5205 -130.3930
quadrupole: 12.2139 -0.0716 1.3457
quadrupole: -4.2192 1.5459 2.6734 12.2139 -0.0716 1.3457
hfenergy: -1316.435092 hartree
pointgroup: C01[X(C16H14Cl1N3O1)]
dipole: -1.0906718 2.2403587 -0.5249951 debye
polarizability: 358.8726558|14.6342028|209.2177717|-3.2223991|1.5316279|97.2334213 unknown
InChI: InChI=1S/C16H14ClN3O/c17-10-5-7-11(8-6-10)20-16(21)13-9-18-14-4-2-1-3-12(14)15(13)19-20/h5-9,19H,1-4H2
charge 0 multiplicity 1
35 atoms
Cl 6.834709 1.18396 0.008865
O  1.024124 -2.780409 0.141804
N  -0.011023 0.634443 -0.053095
N  0.99139 -0.390079 -0.077067
N  -3.445293 -1.737807 0.231458
C  -2.550946 0.558993 -0.029426
C  -2.766351 2.058762 -0.162912
C  -4.202933 2.482971 0.22031
C  -5.235991 1.542344 -0.438928
C  -5.064883 0.096917 0.076599
C  -3.61934 -0.371667 0.083922
C  -1.257718 -0.01186 -0.005501
C  -1.056246 -1.408706 0.119884
C  0.386457 -1.693448 0.064157
C  -2.186239 -2.243627 0.251274
C  2.361992 -0.026947 -0.026977
C  3.363469 -1.000498 -0.2975
C  2.737524 1.310089 0.273826
C  4.722235 -0.629456 -0.276895
C  4.098991 1.679584 0.282586
C  5.074473 0.705807 0.002172
H  -2.028105 2.596895 0.465872
H  -2.567667 2.367505 -1.211908
H  -4.321841 2.442008 1.320935
H  -4.375425 3.53116 -0.086407
H  -5.103732 1.56753 -1.539197
H  -6.264141 1.891936 -0.231619
H  -5.654982 -0.619657 -0.522689
H  -5.454947 0.014711 1.111708
H  0.157943 1.415879 -0.696964
H  -2.080884 -3.327266 0.365665
H  3.072664 -2.03308 -0.500022
H  1.982158 2.052919 0.546114
H  5.495243 -1.375415 -0.481463
H  4.390714 2.706707 0.518418
