program: Gaussian 09
title: 000128119
version: EM64L-G09RevD.01
frameworkgroup: C1[X(C14H20N6O3)]
method: RPBEPBE
basis: SDD
operation: Freq
keyword: #p
keyword: freq=noraman
keyword: PBEPBE/SDD
title: #p freq=noraman PBEPBE/SDD
converged: YES YES NO NO
title: Mulliken charges:
elementType: O O O N N N N N N C C C C C C C C C C C C C C H H H H H H H H H H H H H H H H H H H H
charge: -0.177024 -0.181067 -0.244716 -0.285184 -0.409293 0.084911 -0.524811 -0.395683 -0.649725 -0.272680 -0.597769 0.478951 0.220589 -0.401731 -0.410319 -0.419460 -0.234972 -0.235517 -0.258321 -0.245122 0.217938 -0.536471 0.305569 0.240244 0.244567 0.233427 0.277651 0.256577 0.206362 0.247634 0.242083 0.331212 0.234710 0.231674 0.217726 0.236288 0.254435 0.237256 0.285389 0.285397 0.264195 0.344957 0.300123
chargesum: 0.00000
title: Mulliken charges with hydrogens summed into heavy atoms:
elementType: O O O N N N N N N C C C C C C C C C C C C C C
charge: -0.177024 -0.181067 -0.244716 -0.007533 -0.078081 0.084911 0.045975 -0.131488 -0.004646 -0.032437 -0.119774 0.478951 0.220589 0.061208 -0.162685 -0.177377 -0.000262 -0.003843 -0.040595 -0.008834 0.217938 -0.044780 0.305569
polarizability: 3.04663586e+02 -3.66082990e+00 1.78953613e+02 1.75367012e+01 1.65755801e+01 1.50764159e+02
1716.lowfreq: -9.6913 -7.2502 -3.2755 -0.0010 -0.0005 -0.0001 10.5779 16.7500 22.4676
frequency: 8.1926 16.4519 22.4390 25.9024 31.5954 36.6812 46.6404 55.8347 61.8794 78.9288 96.9282 107.8654 120.9264 125.6178 167.2890 177.2617 194.1681 206.7397 227.4125 248.4245 283.1605 295.0995 333.1634 341.1317 352.9694 356.8066 378.8436 401.9832 407.2890 486.8494 494.3999 501.6926 536.9368 555.9620 579.0393 583.5281 617.0440 635.0970 654.1302 659.7304 687.4188 702.4968 707.6545 709.5053 719.9451 741.5834 762.6481 804.4206 814.2839 858.9589 886.7154 894.6833 916.8297 918.0874 926.5426 952.4263 972.6215 980.7315 989.8589 999.5771 1014.8367 1026.8449 1038.4859 1059.3574 1083.9663 1092.1205 1104.7724 1143.9412 1145.4811 1148.1270 1152.9775 1153.2865 1159.8174 1173.6444 1188.5087 1213.9837 1221.2184 1270.4149 1279.8545 1291.9776 1310.5243 1314.8260 1326.9275 1334.1298 1337.2227 1362.8341 1379.0858 1437.5697 1439.7840 1447.8444 1464.6931 1467.0420 1473.9418 1483.3515 1508.8260 1589.4418 1604.1078 1611.7473 1615.0916 1643.7169 1662.9091 1680.3129 1686.6571 2946.2361 2969.3974 2974.8357 2982.8225 3001.5768 3003.2406 3024.7603 3064.2074 3111.9017 3124.1267 3136.2570 3147.5613 3165.8268 3369.7949 3419.3635 3457.1223 3474.7704 3537.5948 3572.6555 3694.8034
redmass: 5.5292 6.5886 4.8264 5.2578 4.4342 4.1761 3.3640 2.7124 4.4523 3.8282 4.6232 4.0264 3.3142 6.6327 4.0039 3.9017 2.2005 1.5573 4.4727 4.0066 4.5241 3.2703 2.6518 2.5189 4.0796 2.1501 6.1492 2.8501 3.6474 3.8509 1.1758 3.3071 2.6535 2.7027 1.3358 4.7771 6.3088 3.8753 3.6850 2.4206 1.1601 3.0344 1.7286 8.3493 2.9167 1.8573 1.8779 4.1876 3.6521 1.2480 1.4639 1.5736 1.7028 2.6275 3.8925 2.0231 2.0756 1.4523 5.8243 1.3402 3.7343 2.2069 2.4449 2.3474 2.3137 3.3186 4.6689 2.2450 1.2539 1.4782 2.1332 3.2048 3.3742 1.0534 1.1197 1.6795 1.7360 1.2822 1.6138 1.4466 1.5822 1.3488 1.3924 1.3371 1.2046 1.4347 7.4792 1.3014 1.8741 1.6250 1.0974 1.1585 1.1411 2.2070 1.8027 5.9591 1.2485 6.0921 5.9467 4.2092 1.0857 9.1449 5.6570 1.0568 1.0599 1.0872 1.0831 1.0605 1.1026 1.1016 1.1033 1.0882 1.0869 1.0908 1.0957 1.1013 1.0749 1.0732 1.0460 1.0764 1.0459 1.0959 1.1035
irintensity: 3.4433 4.8820 12.0860 0.8999 2.3759 2.0157 0.6788 2.3246 0.9676 7.5285 2.5057 8.0562 10.8502 2.2984 2.7990 2.1452 35.0423 27.6430 0.0817 48.2670 3.6076 3.1124 15.8910 6.4591 5.4509 81.6245 12.6021 0.6891 17.5694 9.7039 208.2431 21.5471 1.9776 30.4506 101.1507 6.5199 0.0926 9.4854 69.0616 3.6306 90.4108 157.7952 57.8384 20.4075 222.6376 51.1260 49.8800 12.1536 11.7444 0.1768 38.2233 6.7209 0.5070 2.1472 8.2648 16.0367 7.9360 0.6523 0.0446 0.4400 3.2623 4.6034 26.9935 11.6479 16.9150 5.4065 299.0866 43.8526 1.0100 53.4274 59.1515 145.1221 66.2568 0.1742 0.0948 3.4734 10.1530 3.3880 310.8762 59.8931 54.9918 5.9686 36.9223 18.2433 0.3869 26.8669 0.6449 107.6193 4.8970 397.9896 55.4187 25.5213 9.7009 16.6079 290.0094 1.6621 132.3092 7.9723 1.7145 34.2663 27.3864 171.3977 339.1619 26.8990 28.8127 41.3455 19.0759 26.6569 34.7111 13.4687 10.2676 9.4772 3.6598 6.6632 29.9761 19.0712 16.4515 4.1525 3.1386 16.6657 50.1278 3.5782 43.1441
temp: 298.150 k
press: 1.00000 atm
elementType: 8 8 8 7 7 7 7 7 7 6 6 6 6 6 6 6 6 6 6 6 6 6 6 1 1 1 1 1 1 1 1 1 1 1 1 1 1 1 1 1 1 1 1
symmnumber: 1
zpe: 895907.8 jmol-1
zpe.correction: 0.341233 hartree
zpe.thermalcorrener: 0.366068 hartree
zpe.thermalcorrenthalpy: 0.367013 hartree
zpe.thermalcorrgfe: 0.279992 hartree
zpe.sumelectzpe: -1097.918319 hartree
zpe.sumelectthermal: -1097.893484 hartree
zpe.sumelectthermalent: -1097.892540 hartree
zpe.sumelectthermalfe: -1097.979560 hartree
dipole: -1.0196 -8.4546 -3.0067
dipole: 9.0311
quadrupole: -104.3639 -146.6432 -134.0686
quadrupole: -31.0179 1.5135 -3.0045
quadrupole: 23.9947 -18.2847 -5.7100 -31.0179 1.5135 -3.0045
hfenergy: -1098.2595521 hartree
pointgroup: C01 [X(C14H20N6O3)]
dipole: -0.6642335 -3.3985765 -0.7955967 debye
polarizability: 303.057006|-11.486587|183.4541415|21.0404743|11.2170912|147.8702106 unknown
InChI: InChI=1S/C14H20N6O3/c15-9-12(21)19-13(22)11(8-10-4-2-1-3-5-10)17-6-7-18-20-14(16)23/h1-5,7,11,17,19-20H,6,8-9,15-16H2
charge 0 multiplicity 1
43 atoms
O  0.004005 1.322494 1.237934
O  -1.911433 3.405851 0.398891
O  7.01899 1.061466 -0.15708
N  1.173808 -1.095452 0.304128
N  -1.661253 1.204811 -0.434935
N  4.569571 -0.343038 -0.291319
N  -4.203281 3.886604 -1.257818
N  5.792158 -0.966957 -0.137335
N  8.102047 -0.969376 0.22848
C  -0.237882 -0.800196 0.019903
C  -1.148707 -1.759088 0.858479
C  -2.626566 -1.661149 0.511274
C  -0.601197 0.685545 0.341889
C  2.153657 -0.465372 -0.622468
C  -3.542987 -1.002204 1.370182
C  -3.11285 -2.203278 -0.709307
C  -4.907761 -0.882826 1.020243
C  -4.475575 -2.083019 -1.06527
C  3.509425 -1.099358 -0.433661
C  -5.378547 -1.419186 -0.200954
C  -2.291373 2.477021 -0.34769
C  -3.528549 2.593827 -1.288327
C  6.972725 -0.185642 -0.027481
H  -0.420432 -1.00252 -1.055116
H  -0.764228 -2.77698 0.663518
H  -0.985018 -1.541135 1.93097
H  1.395519 -0.844318 1.280102
H  2.249455 0.63472 -0.505206
H  1.800755 -0.664678 -1.656232
H  -3.183839 -0.577589 2.315424
H  -2.423494 -2.739652 -1.374589
H  -2.105876 0.534047 -1.072443
H  -5.601725 -0.375501 1.699695
H  -4.834871 -2.514436 -2.006407
H  3.531915 -2.208853 -0.420702
H  -6.436206 -1.329558 -0.471988
H  -4.24597 1.794528 -1.011782
H  -3.203652 2.372848 -2.325071
H  -4.595491 4.112041 -0.337219
H  -3.611007 4.657344 -1.585538
H  5.857826 -1.996294 -0.135226
H  8.988772 -0.475751 0.291322
H  8.074543 -1.962038 0.452429
