program: Gaussian 09
title: 000012125
version: EM64L-G09RevD.01
frameworkgroup: C1[X(C8H6N2O2)]
method: RPBEPBE
basis: SDD
operation: Freq
keyword: #pfreq=noraman
keyword: PBEPBE/SDD
title: #p freq=noraman PBEPBE/SDD
converged: YES YES NO NO
title: Mulliken charges:
elementType: O O N N C C C C C C C C H H H H H H
charge: -0.198740 -0.203662 0.022735 -0.005729 0.450824 -0.481174 0.382383 -0.382637 -0.515359 -0.364323 -0.187850 -0.156067 0.289901 0.265047 0.273283 0.273464 0.291863 0.246040
chargesum: 0.00000
title: Mulliken charges with hydrogens summed into heavy atoms:
elementType: O O N N C C C C C C C C
charge: -0.198740 -0.203662 0.022735 -0.005729 0.450824 -0.191273 0.382383 -0.117590 0.031389 -0.072460 0.058190 -0.156067
polarizability: 1.52880547e+02 5.13268093e+00 1.10592321e+02 -2.06482371e-02 -7.49255925e-02 4.47083700e+01
1716.lowfreq: -10.5352 -0.9164 -0.0004 0.0004 0.0004 6.6008 19.8727 58.7600 110.2751
frequency: 19.8059 58.7494 110.2743 155.8813 190.4740 202.3490 318.8858 352.3987 375.1870 422.4073 423.1497 487.7403 521.0082 621.9989 661.9422 672.9899 701.7247 754.7871 812.2713 854.5099 892.1445 957.4788 966.4929 969.1498 990.3395 1007.1433 1088.6495 1092.7020 1182.1429 1198.3804 1213.7608 1223.9965 1280.7726 1309.3347 1375.8048 1398.8995 1435.8911 1439.5730 1482.5416 1591.3631 1621.5270 2208.5414 2987.3298 3035.7020 3145.0438 3160.6414 3164.9661 3190.0102
redmass: 4.8918 9.5595 9.7105 4.5942 9.0093 3.1494 6.6818 3.5319 9.8140 3.1164 8.3599 4.3673 6.9911 6.5145 8.1897 3.8119 2.9001 8.1776 1.4875 6.1326 1.4704 1.4045 3.8646 1.7810 6.2700 1.3622 1.6334 1.9179 1.1790 2.9260 1.0907 5.0907 1.6319 1.3651 11.2622 6.0134 1.5315 1.6026 2.7186 6.5804 6.8269 12.4724 1.0593 1.0991 1.0891 1.0923 1.0939 1.0966
irintensity: 13.4843 0.1515 9.2635 0.1894 0.2595 5.3449 0.7088 0.7557 0.4079 1.2480 0.8348 5.1823 0.4323 3.4771 13.8206 1.4747 42.7552 17.4551 39.3139 1.8192 0.0077 11.5106 2.5375 9.6905 0.2381 1.8194 25.4340 13.9002 14.0073 58.1223 0.2054 200.7559 0.7905 0.0297 111.9311 0.6762 2.1351 41.3136 38.7290 5.0725 7.0910 6.6835 2.4811 0.8819 1.9553 1.4760 7.3246 3.2314
temp: 298.150 k
press: 1.00000 atm
elementType: 8 8 7 7 6 6 6 6 6 6 6 6 1 1 1 1 1 1
symmnumber: 1
zpe: 330940.1 jmol-1
zpe.correction: 0.126048 hartree
zpe.thermalcorrener: 0.136369 hartree
zpe.thermalcorrenthalpy: 0.137313 hartree
zpe.thermalcorrgfe: 0.088311 hartree
zpe.sumelectzpe: -567.458563 hartree
zpe.sumelectthermal: -567.448243 hartree
zpe.sumelectthermalent: -567.447299 hartree
zpe.sumelectthermalfe: -567.496300 hartree
dipole: 1.3220 0.4517 0.0463
dipole: 1.3977
quadrupole: -104.5624 -60.8205 -68.6617
quadrupole: -8.8285 0.1468 -0.0316
quadrupole: -26.5475 17.1944 9.3531 -8.8285 0.1468 -0.0316
hfenergy: -567.5846113 hartree
pointgroup: C01 [X(C8H6N2O2)]
dipole: 0.4932463 0.2350692 -0.0621201 debye
dipolederiv: -0.8757385 0.083319 -0.0749496 0.038695 -0.4502328 0.1071463 -0.0547848 0.1098268 -0.276682 -0.5485517 -0.1098063 0.0327924 -0.1044378 -0.7163423 0.221162 0.0301705 0.2209805 -0.3258061 1.5827213 0.2362446 -0.0314952 0.3003412 1.0394857 -0.3759924 -0.0606008 -0.379975 0.3610645 -0.2900343 0.0353137 -0.0214529 -0.0276512 -0.2032159 -0.0123516 0.0097135 -0.0089019 -0.2196085 0.3341473 -0.2419835 0.1338359 -0.3718835 -0.082483 0.0010994 0.1972643 0.00756 -0.0284288 -0.0352348 0.1984158 -0.0870158 -0.0178923 -0.0504777 -0.0334583 0.0129213 -0.0210152 -0.1082107 -0.4215256 -0.2429526 0.0854302 -0.2716107 -0.0595476 0.0431176 0.0982534 0.0448479 0.0518784 0.0094748 0.067909 -0.0249953 0.1226505 -0.0158058 -0.0343867 -0.0517083 -0.0377925 -0.0902957 0.0698211 -0.0335953 0.0077226 0.0196537 0.0767102 0.073631 -0.0210651 0.0717726 0.1947272 0.0130156 -0.0502286 0.0304586 0.2006913 -0.0333054 -0.0248998 -0.0861214 -0.0389575 -0.0977365 -0.2227072 0.0009291 -0.0056922 0.0015266 0.1422966 -0.1256345 -0.0059182 -0.1254891 -0.0696114 0.0983811 0.0784129 -0.029295 0.1542568 -0.0087371 -0.0070209 -0.0645946 -0.0112544 -0.0400472 0.1530032 0.005189 -0.003149 0.0289873 0.054751 0.052948 -0.0138258 0.0513373 0.1401887 0.0180145 -0.0630447 0.0214642 -0.077369 0.0950821 0.0230266 0.0280737 0.0238485 0.1439264 -0.0096965 0.0001626 -0.0002534 0.008444 0.0048449 -0.0448631 0.0258453 -0.0648231 0.1003646 -0.0074036 -0.0072913 -0.0019754 -0.0211916 0.1152095 0.0238101 -0.0243539 0.0440371 -0.0132534 0.0596541 0.0492824 -0.0296544 0.0191033 0.1272684 0.0238766 -0.0156897 0.0253738 0.1632999 0.072659 -0.0062758 -0.0017757 -0.0023138 -0.0355007 0.0887898 -0.0035793 0.0886241 0.1142308 unknown
polarizability: 150.7661267|11.337478|100.77732|0.5364429|-25.5213387|56.6377914 unknown
InChI: InChI=1S/C8H6N2O2/c9-5-4-7-2-1-3-8(6-7)10(11)12/h1-3,6H,4H2
charge 0 multiplicity 1
18 atoms
O  -3.762747 0.011112 0.071508
O  -2.627136 -1.758586 0.954025
N  -2.67207 -0.588333 0.410355
N  4.568184 0.763531 0.164572
C  1.04422 0.127711 0.291006
C  -0.185575 -0.528048 0.525896
C  -1.384774 0.113351 0.158528
C  1.040798 1.411484 -0.307154
C  2.336792 -0.589133 0.699691
C  -1.408502 1.392202 -0.438391
C  -0.176677 2.035937 -0.667384
C  3.569314 0.158831 0.406182
H  -0.23528 -1.520813 0.984804
H  1.990145 1.925697 -0.492854
H  2.396956 -1.569839 0.188381
H  2.314782 -0.807626 1.78541
H  -2.364973 1.848091 -0.705783
H  -0.160058 3.028332 -1.128393
