program: Gaussian 09
title: 000127964
version: EM64L-G09RevD.01
frameworkgroup: C1[X(C18H23NO2)]
method: RPBEPBE
basis: SDD
operation: Freq
keyword: #p
keyword: freq=noraman
keyword: PBEPBE/SDD
title: #p freq=noraman PBEPBE/SDD
converged: YES YES NO NO
title: Mulliken charges:
elementType: O O N C C C C C C C C C C C C C C C C C C H H H H H H H H H H H H H H H H H H H H H H H
charge: -0.292033 -0.438206 -0.294925 -0.396379 -0.371239 -0.301392 -0.363193 0.339199 -0.708854 0.215726 0.517213 -0.366417 -0.362728 -0.250575 -0.349339 -0.432507 -0.243112 -0.626141 -0.383611 -0.343914 0.276907 0.211891 0.209023 0.179252 0.216916 0.205878 0.204579 0.178782 0.208747 0.211093 0.244492 0.232705 0.246535 0.249328 0.224544 0.253277 0.226581 0.223447 0.190255 0.226275 0.222089 0.213040 0.246722 0.350069
chargesum: 0.00000
title: Mulliken charges with hydrogens summed into heavy atoms:
elementType: O O N C C C C C C C C C C C C C C C C C C
charge: -0.292033 -0.088136 -0.045597 0.024535 0.024929 0.109066 0.024336 0.339199 -0.253269 0.215726 0.517213 -0.133712 -0.116193 -0.026031 -0.096062 -0.205926 -0.019665 0.012477 -0.170572 -0.097192 0.276907
polarizability: 2.48815549e+02 3.50953436e+00 2.23298955e+02 -1.69341363e+01 5.97455111e-01 1.54795807e+02
1716.lowfreq: -3.4536 -2.2905 -0.0004 0.0004 0.0006 6.3377 8.1462 17.3037 27.5805
frequency: 7.1583 16.8289 27.5142 44.9761 46.8259 54.3333 69.2405 114.6524 116.7205 125.1686 133.7509 150.2396 169.6005 181.3499 225.0938 241.0432 274.3620 283.9445 325.2827 343.2518 346.0755 399.2635 406.0444 410.9367 432.8563 442.2906 481.5684 501.8751 519.7503 538.0633 588.1769 601.4208 637.3503 665.0908 701.6250 716.8681 753.1035 757.2415 760.7280 777.1454 805.2979 812.6765 816.7501 830.7055 837.8740 859.8489 915.4352 928.9498 936.4526 946.6037 952.3035 957.3934 973.5916 974.5825 1005.7484 1035.0707 1046.0484 1059.2338 1077.5680 1085.3497 1098.4118 1107.3872 1125.8176 1143.6905 1151.0593 1165.5804 1171.5573 1174.9632 1179.4350 1188.2762 1200.6148 1202.8142 1226.0399 1243.1912 1249.3006 1263.7527 1280.8860 1284.9143 1292.6943 1302.5518 1322.4679 1330.7744 1373.8515 1377.5164 1389.3291 1392.7186 1425.3808 1436.0997 1438.0214 1450.8772 1465.1295 1467.0035 1469.8382 1472.3677 1481.1161 1488.8273 1493.2176 1498.5394 1502.4339 1594.1349 1599.4955 1605.8473 1627.0402 2838.5867 2870.9382 2945.5664 2960.2547 2990.7950 2995.4348 3001.4189 3002.1031 3012.7071 3027.7991 3058.3141 3061.9752 3075.0827 3107.3034 3120.6523 3121.8922 3132.8028 3147.9516 3154.2563 3167.6482 3167.8936 3443.1080 3582.4677
redmass: 3.8090 5.2557 4.2508 2.2664 3.7577 3.4134 3.1629 3.0681 2.4496 2.6501 3.6733 2.2401 4.6393 4.7333 3.1624 1.4022 4.6942 3.4011 5.1105 1.1667 2.4308 3.0619 3.3138 2.9357 3.8504 3.4377 3.8865 3.2904 3.5867 4.0575 4.8765 5.1731 6.6818 1.3079 4.0413 3.2603 1.2821 1.4243 2.7536 3.0542 2.1061 1.1740 1.5980 4.4222 1.7537 1.8200 1.6871 1.2735 1.3873 1.4857 2.0838 1.3682 1.6084 3.4985 2.8477 3.1938 2.1788 2.8299 1.5831 1.8450 1.7831 1.6592 1.8812 1.3838 1.5375 2.7795 1.1721 1.1928 1.1981 1.6461 2.6187 1.5910 2.9109 2.8620 1.2490 1.3475 1.0696 1.1418 1.4916 1.3979 1.2936 1.3430 1.4931 1.8921 3.9363 4.3047 2.8285 1.1509 2.3109 1.1945 1.1417 1.0738 1.0977 1.1476 1.4191 1.2082 1.2429 1.0760 2.5640 7.0763 6.3789 6.4103 6.4138 1.0714 1.0565 1.0551 1.0643 1.0707 1.0725 1.0609 1.1043 1.0751 1.0990 1.1016 1.1047 1.0994 1.0891 1.0889 1.0876 1.0890 1.0948 1.0935 1.0984 1.0958 1.0744 1.0659
irintensity: 0.8293 0.0169 0.4246 1.3407 0.4108 0.1947 1.5090 1.0070 6.1639 0.5623 0.4347 1.8234 2.2579 1.0131 0.6367 1.8121 1.0468 2.4183 1.4547 134.6114 11.5566 10.3291 6.7372 0.2327 1.0194 4.7885 11.4932 11.1778 6.1546 7.3725 18.7282 6.7121 0.4896 123.2339 2.0560 2.4282 80.8332 4.3918 29.3173 9.1906 42.4640 1.1011 4.7522 15.0430 14.2892 4.5131 4.8770 0.8570 1.1873 1.0617 16.5854 0.1604 12.6902 50.3369 4.4651 2.7606 18.6757 10.2885 25.3817 46.0022 0.3021 74.2187 12.5136 228.9684 15.6417 25.4816 16.8534 1.1917 8.2106 28.0424 41.9090 1.7264 124.3639 22.1952 0.3205 13.0942 0.2143 1.3774 0.9011 3.4846 5.7341 0.6362 20.8628 2.0858 14.0139 19.2011 19.5715 2.2065 26.6835 20.8969 19.5126 9.7605 6.0938 21.0401 44.6340 36.5914 10.0159 5.4572 107.4062 8.7009 6.5580 31.4768 25.0829 93.4474 169.2996 34.9567 27.7731 8.7886 61.1247 22.1613 28.4587 49.9538 9.5698 5.9896 84.2436 41.0230 21.3230 9.2325 11.9238 11.9777 6.6789 34.3757 23.7211 4.8581 1.5361 34.0613
temp: 298.150 k
press: 1.00000 atm
elementType: 8 8 7 6 6 6 6 6 6 6 6 6 6 6 6 6 6 6 6 6 6 1 1 1 1 1 1 1 1 1 1 1 1 1 1 1 1 1 1 1 1 1 1 1
symmnumber: 1
zpe: 968904.7 jmol-1
zpe.correction: 0.369036 hartree
zpe.thermalcorrener: 0.390497 hartree
zpe.thermalcorrenthalpy: 0.391441 hartree
zpe.thermalcorrgfe: 0.314008 hartree
zpe.sumelectzpe: -903.319623 hartree
zpe.sumelectthermal: -903.298162 hartree
zpe.sumelectthermalent: -903.297218 hartree
zpe.sumelectthermalfe: -903.374652 hartree
dipole: 3.4549 0.6649 -0.2794
dipole: 3.5293
quadrupole: -123.3529 -121.2955 -122.8722
quadrupole: -4.2328 3.8982 3.7843
quadrupole: -0.8460 1.2113 -0.3653 -4.2328 3.8982 3.7843
hfenergy: -903.6886592 hartree
pointgroup: C01 [X(C18H23N1O2)]
dipole: -1.3679404 -0.2157753 -0.101292 debye
polarizability: 248.9749943|3.4501477|222.7428245|16.9306992|-4.8730152|155.1924914 unknown
InChI: InChI=1S/C18H23NO2/c1-19-12-4-5-13-21-18-7-3-2-6-16(18)14-15-8-10-17(20)11-9-15/h2-3,6-11,19-20H,4-5,12-14H2,1H3
charge 0 multiplicity 1
44 atoms
O  -0.873838 -0.813113 0.348978
O  4.515168 3.684584 -1.265558
N  -6.744552 1.259107 -0.234561
C  -3.049818 0.234075 0.264721
C  -4.520072 0.148719 -0.202925
C  -2.242667 -0.992028 -0.167571
C  -5.342802 1.383812 0.212842
C  1.32767 -1.677554 0.76152
C  1.633773 -0.434813 1.596253
C  0.05587 -1.854587 0.142163
C  2.38204 0.656256 0.826241
C  2.299489 -2.686152 0.573752
C  -0.227314 -3.009908 -0.62691
C  2.035585 -3.841911 -0.197369
C  1.785815 1.298145 -0.289411
C  3.687957 1.056671 1.207812
C  0.767143 -3.99976 -0.795283
C  -7.59234 2.428077 0.064937
C  2.469091 2.306192 -1.001806
C  4.386718 2.062364 0.506424
C  3.773414 2.686286 -0.601345
H  -3.002884 0.320301 1.367364
H  -2.572358 1.143007 -0.149622
H  -4.990639 -0.763492 0.223119
H  -4.574597 0.049174 -1.304431
H  -2.678328 -1.923457 0.251643
H  -2.217237 -1.081073 -1.273933
H  -5.249067 1.534406 1.320434
H  -4.913281 2.288214 -0.263491
H  2.240848 -0.733787 2.471054
H  0.681864 -0.025588 1.979616
H  3.283073 -2.556533 1.041802
H  -1.205463 -3.14638 -1.097184
H  -7.16633 0.381541 0.098636
H  2.808159 -4.607228 -0.326195
H  0.776022 1.004407 -0.596717
H  4.168891 0.576848 2.069177
H  0.544579 -4.890336 -1.393744
H  -7.629119 2.708158 1.14709
H  -7.216739 3.307435 -0.490985
H  -8.625244 2.236441 -0.275865
H  1.990465 2.793162 -1.86249
H  5.394202 2.372034 0.799902
H  4.001652 4.048283 -2.028782
