program: Gaussian 09
title: 000128002
version: EM64L-G09RevD.01
frameworkgroup: C1[X(C10H19Cl2NO5)]
method: RPBEPBE
basis: SDD
operation: Freq
keyword: #p
keyword: freq=noraman
keyword: PBEPBE/SDD
title: #p freq=noraman PBEPBE/SDD
converged: YES YES NO NO
title: Mulliken charges:
elementType: Cl Cl O O O O O N C C C C C C C C C C H H H H H H H H H H H H H H H H H H H
charge: -0.084992 -0.083700 -0.454284 -0.492084 -0.448933 -0.464818 -0.192407 -0.078620 -0.049540 -0.114366 -0.445297 -0.180561 -0.169491 -0.340412 -0.340404 -0.549920 -0.579761 -0.055706 0.227069 0.260116 0.191039 0.253749 0.269691 0.241108 0.230684 0.227798 0.234559 0.214424 0.365163 0.376385 0.260819 0.268522 0.303930 0.262041 0.360670 0.200085 0.377447
chargesum: 0.00000
title: Mulliken charges with hydrogens summed into heavy atoms:
elementType: Cl Cl O O O O O N C C C C C C C C C C
charge: -0.084992 -0.083700 -0.089121 -0.115699 -0.088264 -0.087372 -0.192407 -0.078620 0.177529 0.145750 -0.000509 0.089130 0.071617 0.118070 0.108579 -0.020580 -0.013790 0.144378
polarizability: 1.87129808e+02 -1.72406086e+01 1.63500163e+02 -3.69972547e-01 -3.53588613e-01 1.18200433e+02
1716.lowfreq: -4.8951 -0.0013 -0.0004 0.0002 0.2920 9.6618 11.5157 21.3438 33.5201
frequency: 10.2456 21.2478 33.3941 41.6746 45.7377 57.4788 69.7944 90.3483 101.1979 105.5645 119.9295 122.5556 173.8761 193.0310 201.3241 217.4021 242.7865 262.5449 274.0015 276.7803 293.3235 318.0923 347.4291 388.8243 428.3317 446.0958 459.1760 484.5688 499.6262 526.4771 532.6099 615.8279 645.4549 653.1981 659.4009 683.7281 716.3827 760.6169 774.7976 803.1388 809.5338 861.0357 896.1633 901.0612 957.8639 987.8221 997.0941 1006.3942 1011.8707 1029.1495 1032.8731 1034.4185 1064.9526 1075.9368 1086.0199 1119.5325 1123.6981 1163.8742 1191.9103 1204.0384 1215.6256 1241.4039 1247.9441 1251.1843 1258.9560 1272.4113 1280.0534 1290.2472 1315.3421 1332.0595 1333.7537 1346.7615 1348.7141 1359.1163 1362.4326 1366.1811 1370.0894 1373.3190 1381.6385 1397.6471 1442.1533 1450.9497 1451.5552 1460.8455 1464.8967 1622.4164 2870.1991 2939.7768 2958.7532 2964.3159 2972.7121 2973.4152 3022.5830 3025.6682 3038.2311 3053.0849 3055.9982 3065.4262 3073.9365 3155.0885 3162.7609 3405.9105 3444.7840 3491.1451 3516.9989
redmass: 9.0816 7.2462 6.1224 14.8290 7.2766 7.9180 2.6580 3.5830 6.2880 2.6757 3.7061 4.4947 4.5222 5.7133 4.3958 4.6105 4.4193 5.1523 4.5015 5.0632 4.1761 5.2253 6.4022 4.2709 2.9382 2.4481 1.1541 2.0297 1.1251 3.0597 1.4145 1.4431 2.8736 4.7276 4.2415 3.2370 4.2350 1.1339 1.1691 3.2973 3.5739 3.8578 3.0675 2.8367 2.3540 1.4393 2.7051 1.7079 2.9679 3.8225 3.1795 4.5212 2.5407 2.9783 3.1645 1.5499 1.3994 1.2334 1.4021 1.2276 1.3219 1.1544 1.2618 1.2093 1.5431 1.3072 1.3008 1.2339 1.3361 1.3849 1.2519 1.3391 1.2388 1.3594 1.2928 1.3506 1.3491 1.4009 1.5495 1.2660 1.0825 1.0952 1.0733 1.0931 1.1040 8.6715 1.0697 1.0814 1.0890 1.0591 1.0839 1.0604 1.0852 1.1032 1.1031 1.0904 1.0862 1.0573 1.0567 1.1114 1.1113 1.0646 1.0641 1.0651 1.0650
irintensity: 0.2739 0.7262 1.5528 1.4476 0.1068 0.4757 3.6117 3.1412 2.1999 1.1246 1.0128 7.7470 2.4286 9.5802 3.4449 6.5088 7.6368 4.9928 3.0736 22.4718 11.9436 18.7448 18.6747 3.4266 3.2353 14.4079 106.5521 81.9517 98.5534 14.5514 113.9717 137.3632 14.7340 134.1049 111.3214 9.1728 60.5999 3.6490 10.3431 33.1653 23.3792 5.7604 32.4415 54.3767 48.7322 3.4661 11.8463 20.1259 21.6117 15.1461 8.5372 65.9451 32.9895 90.5968 9.1916 45.6383 28.2421 33.9365 33.9542 11.0614 14.8278 21.2493 15.3572 4.1781 32.6581 42.3382 6.7439 63.2849 9.5939 32.0127 72.8504 17.4878 6.6497 48.3897 12.7458 8.2150 27.1172 17.7275 5.5860 25.3641 5.7357 2.6983 9.9242 11.1082 22.9568 140.0894 151.0661 12.1416 61.2657 39.2282 17.8001 42.3583 20.6660 22.5583 23.0692 29.3431 20.3625 15.1677 17.1759 12.8568 21.9325 60.6403 30.5194 30.1271 36.0305
temp: 298.150 k
press: 1.00000 atm
elementType: 17 17 8 8 8 8 8 7 6 6 6 6 6 6 6 6 6 6 1 1 1 1 1 1 1 1 1 1 1 1 1 1 1 1 1 1 1
symmnumber: 1
zpe: 769687.8 jmol-1
zpe.correction: 0.293159 hartree
zpe.thermalcorrener: 0.314901 hartree
zpe.thermalcorrenthalpy: 0.315845 hartree
zpe.thermalcorrgfe: 0.237887 hartree
zpe.sumelectzpe: -1741.928400 hartree
zpe.sumelectthermal: -1741.906658 hartree
zpe.sumelectthermalent: -1741.905713 hartree
zpe.sumelectthermalfe: -1741.983672 hartree
dipole: -3.6113 -0.6605 1.7677
dipole: 4.0746
quadrupole: -145.1353 -138.7864 -123.2704
quadrupole: 4.5930 4.2047 5.5554
quadrupole: -9.4046 -3.0557 12.4603 4.5930 4.2047 5.5554
hfenergy: -1742.2215588 hartree
pointgroup: C01 [X(C10H19Cl2N1O5)]
dipole: -1.4454059 0.1380239 -0.6794288 debye
polarizability: 184.5158325|18.7379321|166.0455086|-1.0337346|-1.8814453|118.2690633 unknown
InChI: InChI=1S/C10H19Cl2NO5/c11-1-3-13(4-2-12)5-7(15)9(17)10(18)8(16)6-14/h6-10,15-18H,1-5H2
charge 0 multiplicity 1
37 atoms
Cl 5.352766 2.328705 -0.394778
Cl 2.677597 -3.99713 0.689645
O  1.035841 0.747405 1.783658
O  -0.890624 2.407399 0.845663
O  -3.438053 1.639977 0.1256
O  -3.655133 -0.849118 1.230171
O  -4.964865 -1.535252 -1.015704
N  2.057196 -0.181737 -0.86802
C  0.126176 0.245707 0.746435
C  -1.227289 0.974076 0.919286
C  0.735407 0.409248 -0.679857
C  -2.341051 0.686894 -0.114856
C  -2.900224 -0.756419 -0.013389
C  3.216403 0.663718 -1.156097
C  2.208683 -1.631887 -0.767967
C  3.861774 1.26174 0.112432
C  2.720978 -2.096138 0.614585
C  -3.799283 -1.109532 -1.19864
H  -0.003738 -0.827785 0.977739
H  -1.623018 0.732502 1.929167
H  0.018838 -0.046726 -1.405923
H  0.789373 1.489559 -0.907038
H  -1.98535 0.907918 -1.135834
H  -2.056144 -1.482015 -0.012968
H  2.926775 1.496017 -1.828093
H  3.976583 0.065995 -1.695467
H  2.904979 -2.003907 -1.546313
H  1.228655 -2.112582 -0.960342
H  0.884671 1.730526 1.835075
H  -1.749824 2.906929 0.819066
H  4.259779 0.495395 0.792787
H  3.183264 1.933164 0.65565
H  2.094942 -1.740985 1.444851
H  3.773943 -1.828537 0.786951
H  -3.975256 1.250302 0.872449
H  -3.363668 -0.987426 -2.21639
H  -4.515305 -1.314998 1.018463
