program: Gaussian 09
title: 000128082
version: EM64L-G09RevD.01
frameworkgroup: C1[X(C19H16N6O5)]
method: RPBEPBE
basis: SDD
operation: Freq
keyword: #p
keyword: freq=noraman
keyword: PBEPBE/SDD
title: #p freq=noraman PBEPBE/SDD
converged: YES YES NO NO
title: Mulliken charges:
elementType: O O O O O N N N N N N C C C C C C C C C C C C C C C C C C C H H H H H H H H H H H H H H H H
charge: -0.236956 -0.286068 -0.286331 -0.296542 -0.293798 -0.475708 -0.469443 -0.076406 -0.082131 -0.375231 -0.376657 0.359222 0.339945 0.331837 0.333595 0.003961 0.005334 -0.025984 -0.506965 -0.516760 -0.386203 -0.373453 -0.339551 -0.349647 0.102891 0.113616 0.289343 0.289366 -0.489261 -0.489266 0.281213 0.283715 0.272287 0.267928 0.251200 0.250575 0.372617 0.374820 0.369012 0.368609 0.246972 0.240857 0.247443 0.247258 0.240628 0.248118
chargesum: 0.00000
title: Mulliken charges with hydrogens summed into heavy atoms:
elementType: O O O O O N N N N N N C C C C C C C C C C C C C C C C C C C
charge: -0.236956 -0.286068 -0.286331 -0.296542 -0.293798 -0.103091 -0.094623 -0.076406 -0.082131 -0.006219 -0.008047 0.359222 0.339945 0.331837 0.333595 0.003961 0.005334 -0.025984 -0.225752 -0.233045 -0.113917 -0.105525 -0.088351 -0.099072 0.102891 0.113616 0.289343 0.289366 0.246010 0.246738
polarizability: 5.29132290e+02 6.59138762e+00 2.82563846e+02 1.98440372e+01 -2.02921405e+01 1.52968517e+02
1716.lowfreq: -3.9938 -1.5080 -0.0008 0.0010 0.0014 3.2757 14.0185 28.7369 32.0712
frequency: 14.0062 28.7283 32.0691 48.5033 56.7420 65.4850 67.9574 71.7890 80.8253 87.6558 93.5733 107.0613 121.2713 146.7568 162.0586 167.3863 190.4187 213.5931 222.1636 243.8553 256.2406 272.6557 278.0768 286.3444 326.2844 335.3760 358.3111 360.5421 376.7257 390.9824 435.8505 439.6008 460.2602 480.5487 532.5717 559.4915 583.2920 593.7834 637.8041 653.6166 653.8158 656.3902 676.5984 677.4632 679.4345 680.7295 707.7637 708.7523 709.0897 729.4313 733.2766 748.2091 755.4508 756.2371 774.5844 784.1779 826.4633 832.5813 838.2918 850.0397 858.8413 900.7902 901.9881 907.4078 914.6354 932.4296 966.4209 969.6218 977.5325 979.0763 989.5869 1047.1427 1047.9327 1103.1900 1120.0796 1120.2288 1124.0536 1130.6279 1152.3048 1153.2962 1168.4394 1182.1496 1190.6251 1212.7044 1223.8154 1228.9467 1252.6318 1272.8422 1280.6212 1292.1410 1308.3732 1375.8494 1377.4476 1392.6597 1393.6579 1430.7700 1430.9713 1450.6566 1453.6999 1453.8678 1455.5957 1465.3575 1465.9002 1473.8340 1476.0285 1481.5289 1485.5004 1523.4129 1561.2512 1564.6940 1593.4995 1596.6830 1625.1872 1627.7582 1653.2844 1655.5616 3009.3669 3009.4223 3113.6575 3113.7505 3149.6138 3154.3451 3155.9108 3155.9492 3157.5020 3160.4507 3173.2018 3175.2190 3512.5304 3514.5754 3558.5002 3559.1083
redmass: 6.4056 5.9832 6.1374 4.9683 3.2411 1.3079 1.4496 4.1050 3.9213 4.4815 5.7321 7.2867 5.0086 4.4939 4.9012 5.9478 6.6396 6.2709 6.2233 5.6640 4.9488 6.4288 6.8603 5.7671 6.5527 6.9811 5.9534 6.3439 6.2520 7.7364 3.3197 3.2455 6.4271 5.4639 6.0110 5.8603 6.9342 5.8613 4.4668 1.7358 1.3771 3.4196 5.8366 5.8522 10.6415 11.4502 5.1698 3.8061 4.2288 5.7698 5.3823 3.3392 1.1682 1.2784 3.6923 3.4230 4.6794 5.1480 1.5483 2.1527 3.4299 5.7401 1.5252 4.0202 2.0888 4.1593 4.0926 1.3243 1.7765 3.6240 3.3173 4.3229 4.2853 2.0869 1.2523 1.2529 1.6460 1.6047 1.4992 1.4845 1.8472 2.6135 2.3216 2.1516 1.8908 1.7297 2.4078 5.1627 2.0797 1.6409 2.7661 4.7396 4.4743 3.8892 3.7096 1.4222 1.4034 3.1167 1.0512 1.0493 3.0148 1.1532 1.1416 3.0083 3.1702 2.8735 3.3091 9.8622 5.6333 5.7819 7.7916 7.2238 7.0442 7.2565 7.4447 7.5098 1.0297 1.0296 1.1053 1.1053 1.0884 1.0880 1.1049 1.1049 1.0920 1.0929 1.0968 1.0972 1.0827 1.0827 1.0774 1.0774
irintensity: 0.7055 0.0824 0.4939 0.1912 0.3960 0.0749 1.1015 0.2128 0.6322 1.0717 2.8101 11.0124 2.4246 1.4788 2.9967 3.1042 0.9988 26.3923 6.3021 19.0476 9.3317 5.6459 21.1209 1.9632 9.5475 48.9961 9.5616 2.4484 1.9771 2.0776 4.2159 2.9397 11.8963 7.0923 14.3782 22.0617 4.4365 1.0769 8.4047 29.1315 112.0082 20.9937 6.5048 10.7876 6.2460 2.2964 17.5567 52.5836 28.3456 12.8825 20.8657 8.7002 53.1756 180.8662 0.6371 53.0905 5.5846 1.4902 26.4652 33.1972 24.4037 2.7443 13.0916 10.7823 24.5370 3.2836 9.9263 1.5512 1.1377 14.7400 43.1571 53.5157 93.5448 20.6923 0.2036 1.0899 259.2173 23.8225 228.1167 94.7659 643.4442 226.3711 264.8495 2.7378 18.8251 31.9266 15.1038 140.4867 375.7496 64.6598 496.0206 22.8624 47.1943 32.7938 83.2383 21.1924 21.1238 7.8836 15.7346 15.7191 7.9365 76.5196 68.2299 100.9988 103.2992 64.0022 104.0242 143.6822 220.2280 1074.2651 574.4616 199.1012 71.7767 62.7942 219.2709 160.8498 53.6407 34.2169 23.3107 23.8901 7.2404 0.2310 16.6408 14.1766 1.3532 1.5227 7.6187 9.9709 156.5848 180.2392 106.7173 86.7365
temp: 298.150 k
press: 1.00000 atm
elementType: 8 8 8 8 8 7 7 7 7 7 7 6 6 6 6 6 6 6 6 6 6 6 6 6 6 6 6 6 6 6 1 1 1 1 1 1 1 1 1 1 1 1 1 1 1 1
symmnumber: 1
zpe: 889227.8 jmol-1
zpe.correction: 0.338689 hartree
zpe.thermalcorrener: 0.364959 hartree
zpe.thermalcorrenthalpy: 0.365903 hartree
zpe.thermalcorrgfe: 0.279035 hartree
zpe.sumelectzpe: -1436.213333 hartree
zpe.sumelectthermal: -1436.187062 hartree
zpe.sumelectthermalent: -1436.186118 hartree
zpe.sumelectthermalfe: -1436.272986 hartree
dipole: -0.7585 -6.5061 -0.5754
dipole: 6.5754
quadrupole: -82.7183 -175.3938 -174.7608
quadrupole: -12.2252 7.0268 5.7388
quadrupole: 61.5727 -31.1028 -30.4698 -12.2252 7.0268 5.7388
hfenergy: -1436.5520216 hartree
pointgroup: C01 [X(C19H16N6O5)]
dipole: -0.2977954 -2.1870145 1.3493351 debye
polarizability: 528.7927243|19.0140897|216.7995083|14.3488746|-67.7101619|219.0724203 unknown
InChI: InChI=1S/C19H16N6O5/c1-29-18(27)24-16-20-11-5-3-9(7-13(11)22-16)15(26)10-4-6-12-14(8-10)23-17(21-12)25-19(28)30-2/h3-8,22-25H,1-2H3
charge 0 multiplicity 1
46 atoms
O  -0.540735 2.235023 -2.72031
O  7.930654 -2.27092 1.217613
O  -8.451776 -1.804378 0.744088
O  5.589731 -2.52529 1.274093
O  -7.160116 -1.072917 -1.084472
N  4.209255 -0.528654 -0.025684
N  -4.622224 -0.243489 -0.407992
N  5.543718 1.083776 -0.974494
N  -4.140874 -0.398819 1.834347
N  6.639075 -0.715113 0.19559
N  -6.334923 -1.089921 1.120374
C  1.369063 1.527549 -1.443733
C  -1.089118 1.075364 -0.688318
C  3.331249 0.388364 -0.632174
C  -3.301139 0.218696 -0.267312
C  4.187008 1.385907 -1.22233
C  -3.020208 0.111981 1.14367
C  -0.109141 1.648195 -1.673558
C  1.931659 0.440019 -0.722581
C  -2.364698 0.703036 -1.188453
C  2.215593 2.51051 -2.052178
C  -0.804472 0.983486 0.713286
C  3.6145 2.460648 -1.942954
C  -1.757739 0.511918 1.635961
C  5.495045 -0.057453 -0.264565
C  -5.055681 -0.588889 0.866494
C  6.625067 -1.892394 0.925785
C  -7.300781 -1.300883 0.148759
C  8.064647 -3.523864 1.997024
C  -9.573742 -2.077345 -0.184754
H  1.293754 -0.338218 -0.293719
H  -2.570591 0.819223 -2.25688
H  1.728352 3.308239 -2.621345
H  0.167033 1.328971 1.079506
H  4.25353 3.220255 -2.40179
H  -1.541563 0.463039 2.706906
H  4.016953 -1.386601 0.499618
H  -5.208708 -0.331272 -1.242967
H  7.534513 -0.280315 -0.036949
H  -6.550319 -1.307104 2.095715
H  7.643517 -4.371132 1.430933
H  9.146779 -3.643771 2.142144
H  7.541377 -3.430123 2.962882
H  -9.276054 -2.834263 -0.929051
H  -10.380402 -2.451474 0.460034
H  -9.874567 -1.151197 -0.70166
