program: Gaussian 09
title: 000127940
version: EM64L-G09RevD.01
frameworkgroup: C1[X(C21H25N3O2)]
method: RPBEPBE
basis: SDD
operation: Freq
keyword: #p
keyword: freq=noraman
keyword: PBEPBE/SDD
title: #p freq=noraman PBEPBE/SDD
converged: YES YES NO NO
title: Mulliken charges:
elementType: O O N N N C C C C C C C C C C C C C C C C C C C C C H H H H H H H H H H H H H H H H H H H H H H H H H
charge: -0.463414 -0.329571 -0.308430 -0.383501 -0.635531 -0.046886 -0.427747 -0.415592 -0.260431 -0.552186 0.563070 -0.715581 0.310786 -0.569759 0.006006 -0.601077 0.316502 0.474531 -0.424638 -0.228171 -0.383532 -0.417384 0.156070 -0.236710 -0.232983 -0.251673 0.237779 0.206535 0.187581 0.238489 0.174635 0.197035 0.232384 0.230715 0.202684 0.223766 0.221986 0.198802 0.279641 0.194553 0.257315 0.365820 0.331529 0.256046 0.257906 0.228074 0.233141 0.219839 0.224113 0.335376 0.322087
chargesum: 0.00000
title: Mulliken charges with hydrogens summed into heavy atoms:
elementType: O O N N N C C C C C C C C C C C C C C C C C C C C C
charge: -0.131884 -0.329571 -0.076046 -0.017681 0.021932 0.190893 -0.033631 -0.002468 -0.063397 -0.118787 0.563070 -0.071026 0.310786 -0.290118 0.006006 -0.406524 0.316502 0.474531 -0.167323 0.027875 -0.125626 -0.189310 0.156070 -0.003569 -0.013144 -0.027560
polarizability: 2.44323731e+02 3.69592647e+01 2.55945665e+02 3.00705431e+01 8.17102818e+00 2.48686279e+02
1716.lowfreq: -23.0253 -7.7766 -0.0004 0.0003 0.0004 3.8503 5.5949 11.0611 19.9778
frequency: -18.2099 11.0524 19.3191 21.2367 34.5117 45.1308 64.0550 67.3400 99.9391 135.4412 142.7991 149.1690 159.8147 180.0350 203.4550 211.2406 222.4671 230.3343 269.3986 270.8436 304.1987 312.0041 346.4798 357.5125 384.1478 387.0597 397.6830 403.3865 432.2450 444.3149 456.9911 481.5442 487.2614 497.3655 508.1575 570.6613 579.3044 581.3236 601.2020 615.8889 616.5047 639.4414 654.3674 663.2717 704.8512 723.8848 736.8499 752.6402 757.7665 777.2665 784.8313 788.0913 802.9924 854.8927 856.9491 865.9145 881.5692 884.6563 893.2026 898.4586 922.3922 927.4086 949.0832 962.6659 975.4831 989.3773 990.7666 994.3605 1000.4019 1005.7843 1025.8496 1037.2650 1047.4269 1051.4239 1059.7413 1085.4658 1094.8439 1105.4209 1117.6997 1134.5281 1145.0770 1165.5439 1170.4003 1187.5237 1200.9814 1205.7648 1218.1189 1223.1327 1234.7575 1251.1290 1282.8524 1287.3837 1299.1116 1312.2548 1318.8288 1327.0904 1332.9496 1345.0234 1362.1741 1364.8191 1374.9204 1378.1748 1380.9603 1388.1948 1424.4476 1437.5708 1439.7295 1456.7785 1458.7688 1463.9178 1470.0120 1471.4912 1471.8628 1475.2281 1483.2790 1510.9811 1553.2306 1590.4893 1602.6582 1612.2220 1619.6806 1632.5972 2827.0183 2925.6534 2954.9009 2963.7782 2989.8967 2996.1596 3025.1318 3039.0022 3058.6671 3060.9923 3068.5655 3107.0145 3117.3543 3121.1323 3133.2675 3146.1375 3159.3328 3159.8107 3213.6901 3239.6490 3416.1856 3492.3553 3536.9665 3543.5999 3690.5912
redmass: 4.3818 5.2900 5.1101 4.5923 4.7115 4.5954 3.5327 4.6054 3.8614 5.0000 5.2451 3.7130 3.7588 3.1262 4.4144 1.2238 2.4052 3.4973 2.6625 2.2344 1.6526 3.4484 2.7059 2.8775 3.1773 7.5521 3.4713 2.8167 2.8346 1.6987 2.1700 2.5969 2.8150 3.6674 2.9989 3.1121 1.7617 2.7461 3.4509 5.9394 3.6373 2.7300 2.1141 3.1924 1.7930 2.4258 1.8933 2.3996 2.0369 1.1719 3.3312 3.5880 2.0857 1.2483 1.9196 1.3058 4.4663 1.5134 2.1114 4.5185 1.4981 1.5122 1.7531 2.4186 1.3814 4.9537 5.5420 1.3347 2.8083 2.6772 2.1686 2.5636 1.7208 2.0116 1.8121 1.7995 1.3748 1.7209 2.6686 1.5150 2.0176 1.2926 1.0597 1.1230 1.3420 1.6775 1.8809 1.6038 1.9701 1.4980 1.7434 1.2406 1.2144 1.4473 2.0397 1.2841 1.2804 1.4351 1.7806 2.9123 1.3240 1.8693 5.4967 3.9499 2.5657 2.0087 1.1813 1.2512 1.4121 2.4041 1.2266 1.1751 2.3851 1.1085 2.1267 4.8222 3.3526 5.9484 6.0744 6.0428 1.7809 4.1574 1.0708 1.0841 1.0623 1.0371 1.0629 1.0831 1.0982 1.0879 1.0986 1.0988 1.0992 1.0868 1.0900 1.0864 1.0922 1.0949 1.0927 1.1004 1.0910 1.1064 1.0736 1.0823 1.0447 1.0656 1.1039
irintensity: 0.0786 0.2014 0.5918 0.0175 0.0384 9.0110 0.8539 1.7239 6.8618 0.9415 1.4751 2.2018 1.5520 1.2764 17.2423 1.0480 3.8560 1.5803 15.5784 36.1554 96.4370 5.8667 2.2087 3.9638 3.5240 2.4310 2.2753 0.0463 17.2345 58.3588 1.7095 63.7425 40.5707 2.7976 35.5327 3.1322 79.3294 49.2061 9.5806 1.7525 13.5299 12.1120 36.1621 52.5111 39.8293 3.0477 10.9323 32.8639 22.7843 196.6071 3.1601 9.6949 0.4038 0.7466 18.9763 5.6597 0.1611 7.2243 0.0529 8.4020 4.4596 36.0443 3.8919 2.2487 0.0691 16.3776 30.9024 1.3401 37.0984 4.2530 4.1744 21.0568 23.8371 3.8933 21.3095 19.9873 30.1494 3.7108 17.4607 45.5069 33.1480 21.3771 1.2430 2.8024 33.2746 14.1912 5.3081 29.7738 12.9629 2.2539 21.3216 17.6693 1.7644 0.9244 97.1219 5.7046 2.9219 11.8156 40.8170 122.7901 8.2028 35.3299 3.5388 118.1322 34.5001 16.9907 16.9536 8.7150 4.0724 7.0588 11.4642 9.6401 17.6919 4.1894 14.7937 7.5843 135.8345 0.5700 38.6404 2.7837 144.9896 88.1349 167.7990 48.3111 31.1640 49.6331 40.6027 12.8987 23.9045 17.5773 17.3928 46.8318 49.3841 9.1194 16.9442 0.8448 27.8113 30.6483 1.6923 13.8543 0.9216 5.0844 1.2497 147.0500 43.3496 3.4882 32.3801
temp: 298.150 k
press: 1.00000 atm
elementType: 8 8 7 7 7 6 6 6 6 6 6 6 6 6 6 6 6 6 6 6 6 6 6 6 6 6 1 1 1 1 1 1 1 1 1 1 1 1 1 1 1 1 1 1 1 1 1 1 1 1 1
symmnumber: 1
zpe: 1104279.2 jmol-1
zpe.correction: 0.420598 hartree
zpe.thermalcorrener: 0.444672 hartree
zpe.thermalcorrenthalpy: 0.445617 hartree
zpe.thermalcorrgfe: 0.364443 hartree
zpe.sumelectzpe: -1128.060865 hartree
zpe.sumelectthermal: -1128.036790 hartree
zpe.sumelectthermalent: -1128.035846 hartree
zpe.sumelectthermalfe: -1128.117020 hartree
dipole: 4.2795 2.3486 1.5442
dipole: 5.1200
quadrupole: -156.4353 -147.8905 -137.8320
quadrupole: 10.6791 7.9939 9.5263
quadrupole: -9.0493 -0.5045 9.5539 10.6791 7.9939 9.5263
hfenergy: -1128.4814626 hartree
pointgroup: C01 [X(C21H25N3O2)]
dipole: 1.1241307 1.5897874 0.516256 debye
polarizability: 212.7291705|25.081463|287.0704421|10.7327987|15.663456|249.1560616 unknown
InChI: InChI=1S/C21H25N3O2/c1-14(7-8-15-5-3-2-4-6-15)24-13-19(25)17-11-16-9-10-23-20(16)18(12-17)21(22)26/h2-6,9-12,14,19,23-25H,7-8,13,22H2,1H3
charge 0 multiplicity 1
51 atoms
O  -1.364293 3.333894 -2.561164
O  -3.062976 -1.852597 2.187597
N  1.250794 2.729925 0.097274
N  -2.749603 -2.415408 -0.460237
N  -2.422833 0.179965 3.077031
C  2.657196 2.246013 0.173142
C  2.956107 1.754516 1.610086
C  0.69379 2.947336 -1.247083
C  -0.863836 2.898466 -1.242256
C  2.102166 0.531096 2.048032
C  -1.41331 1.504191 -0.988684
C  3.701843 3.299417 -0.282665
C  -1.984149 -0.727756 -1.800494
C  -1.524493 0.586151 -2.057698
C  -2.327954 -1.093213 -0.448648
C  -1.763158 1.116988 0.333715
C  -2.223809 -0.187698 0.641072
C  2.419992 -0.73224 1.25808
C  -2.220722 -1.899713 -2.619343
C  -2.685339 -2.905511 -1.769583
C  1.574211 -1.16593 0.204231
C  3.58404 -1.493097 1.545492
C  -2.59663 -0.672545 2.001693
C  1.881139 -2.32667 -0.542854
C  3.89659 -2.65242 0.80058
C  3.045061 -3.073568 -0.248382
H  2.721111 1.372138 -0.504788
H  4.031543 1.497459 1.678574
H  2.785325 2.592889 2.319636
H  1.063692 2.148572 -1.91613
H  1.002817 3.924268 -1.704689
H  -1.229603 3.592358 -0.451605
H  1.103388 3.540762 0.716272
H  1.03716 0.793734 1.917946
H  2.27842 0.352288 3.127145
H  3.478336 3.671326 -1.299701
H  4.719288 2.866181 -0.299285
H  3.713642 4.167226 0.40624
H  -1.278568 0.916877 -3.071432
H  -1.666899 1.872579 1.123083
H  -2.073282 -1.987462 -3.694061
H  -3.053566 -2.868745 0.408334
H  -0.903171 4.174519 -2.814767
H  -2.976619 -3.929029 -1.998198
H  0.667348 -0.594523 -0.024827
H  4.244225 -1.179911 2.365129
H  1.206639 -2.646577 -1.34583
H  4.796595 -3.230759 1.040792
H  3.283098 -3.975917 -0.823266
H  -2.679241 -0.166892 3.999997
H  -2.028001 1.112348 2.986594
