program: Gaussian 09
title: 000127854
version: EM64L-G09RevD.01
frameworkgroup: C1[X(C5H9ClN2O)]
method: RPBEPBE
basis: SDD
operation: Freq
keyword: #p
keyword: freq=noraman
keyword: PBEPBE/SDD
title: #p freq=noraman PBEPBE/SDD
converged: NO YES NO NO
title: Mulliken charges:
elementType: Cl O N N C C C C C H H H H H H H H H
charge: -0.093495 -0.284972 -0.051251 0.048483 -0.356175 -0.370121 -0.364661 -0.371113 -0.403210 0.295935 0.244799 0.221564 0.223361 0.246903 0.250637 0.241386 0.252167 0.269763
chargesum: 0.00000
title: Mulliken charges with hydrogens summed into heavy atoms:
elementType: Cl O N N C C C C C
charge: -0.093495 -0.284972 -0.051251 0.048483 -0.060240 0.096243 0.105603 0.120911 0.118719
polarizability: 1.03390648e+02 3.20917959e+00 7.12732896e+01 -6.01013951e+00 3.53582596e-01 6.43546587e+01
1716.lowfreq: -22.2150 -8.1160 -0.0020 -0.0017 0.0010 11.5767 54.8886 131.0661 140.2667
frequency: 54.7991 131.0369 140.2544 282.5955 299.8809 318.0988 352.7414 361.7004 443.6261 473.7803 524.4556 636.6142 711.3591 769.8857 793.6454 839.4096 907.6287 944.1166 987.6541 1027.8233 1034.5564 1086.6066 1105.6916 1151.1023 1179.9157 1197.3527 1252.0933 1260.7647 1305.7236 1325.1699 1326.2195 1334.1493 1345.4701 1352.2915 1369.3023 1438.7512 1449.4888 1458.3545 1467.8149 2985.9255 2990.8415 3000.5752 3004.3676 3072.0465 3073.8157 3079.7814 3084.6475 3089.2668
redmass: 7.2689 7.6684 4.3664 3.9004 4.1762 2.3848 3.6282 2.0059 5.2363 4.0704 3.2280 4.7311 2.3248 3.9279 1.5974 3.2632 2.3927 3.1580 1.6037 2.1836 2.3268 1.6025 1.3055 2.1909 1.2085 1.2943 1.3941 2.4344 1.4448 2.7533 1.4498 1.6705 1.3596 1.4490 1.8858 1.0874 1.0834 1.0762 1.0861 1.0658 1.0656 1.0628 1.0609 1.0954 1.0962 1.1021 1.0899 1.0996
irintensity: 6.0974 0.8190 8.2005 5.4556 1.3019 2.0561 2.9327 0.6589 5.6545 0.5086 21.0373 2.4253 19.4654 13.9603 0.1268 16.9362 7.9464 143.2686 12.3986 6.0591 28.6873 51.2684 0.9341 3.8643 1.5585 30.5209 41.5396 31.0679 10.3704 92.8342 3.4062 7.6344 5.2950 10.2787 29.8703 13.2482 16.8531 14.5007 16.8522 9.6968 15.4176 20.2556 22.2325 22.7499 15.9364 5.4626 21.0599 7.3366
temp: 298.150 k
press: 1.00000 atm
elementType: 17 8 7 7 6 6 6 6 6 1 1 1 1 1 1 1 1 1
symmnumber: 1
zpe: 375766.1 jmol-1
zpe.correction: 0.143122 hartree
zpe.thermalcorrener: 0.151715 hartree
zpe.thermalcorrenthalpy: 0.152659 hartree
zpe.thermalcorrgfe: 0.108996 hartree
zpe.sumelectzpe: -839.948892 hartree
zpe.sumelectthermal: -839.940298 hartree
zpe.sumelectthermalent: -839.939354 hartree
zpe.sumelectthermalfe: -839.983017 hartree
dipole: 3.2823 0.5774 1.8832
dipole: 3.8280
quadrupole: -83.8014 -56.3925 -56.9903
quadrupole: 0.0501 2.7689 -0.2728
quadrupole: -18.0733 9.3356 8.7377 0.0501 2.7689 -0.2728
hfenergy: -840.0920135 hartree
pointgroup: C01 [X(C5H9Cl1N2O1)]
dipole: -1.3879918 -0.1996387 0.549343 debye
dipolederiv: -0.4028541 0.0044816 -0.1925447 0.0073237 -0.2575256 0.0117937 -0.2718243 0.0158921 -0.5049414 -0.9371682 -0.0558278 -0.1131183 -0.8968662 -0.4777377 -0.1365085 -0.1202653 0.0011558 -0.2296916 -1.0090043 -0.2234949 -0.0742809 0.1792456 -0.1664568 0.0256916 -0.0839577 -0.0672651 -0.2658295 1.5603094 0.2291434 0.3097923 0.5941622 0.0621632 0.0818152 0.3538831 0.0461762 -0.0253066 0.4645836 0.0013989 0.3206375 -0.0095256 0.2793751 -0.0223501 0.4370781 -0.0297111 0.6301371 -0.001801 0.0096432 -0.007679 -0.0194134 -0.061415 -0.0243271 -0.0723872 0.0082257 -0.0270665 0.0429992 -0.0288332 -0.0081591 0.0288459 -0.018549 0.0389309 -0.1073371 0.005016 -0.0253739 0.2559586 0.1674644 0.0258618 0.2715669 0.2827379 0.0491707 -0.0303916 0.0495307 0.2502898 -0.0392207 -0.0752339 -0.0087698 -0.2100365 0.1452942 -0.0412781 -0.0645664 -0.0152137 0.247473 -0.0988267 0.0147513 0.0387762 0.0161095 0.057102 -0.0072684 0.023445 -0.0073908 -0.0731231 -0.0426659 -0.1153816 0.0050297 -0.0860147 -0.052471 -0.0056785 0.0070478 -0.0377081 0.1021431 0.0360722 0.0467595 -0.0872342 0.0564814 0.0747381 0.0100644 -0.0242001 0.0042009 -0.1108219 0.0165696 -0.038007 -0.084099 -0.0485926 0.0898662 -0.0033888 -0.0154844 -0.009832 -0.1072979 -0.0153939 0.0922756 -0.0002491 0.0762501 -0.0814587 0.014785 0.017802 0.0477897 0.1020157 0.027127 0.1131121 -0.0059076 0.030262 -0.0299742 0.0128635 -0.0058164 0.0440644 0.0998681 0.0181348 -0.0799272 -0.0594353 -0.0847689 0.0568919 0.0219842 -0.032681 -0.0473528 -0.0904561 0.06054 0.0592752 -0.0622988 0.0982093 0.0681173 -0.0249244 -0.0133255 0.024947 -0.0797092 0.0646404 -0.1215996 0.0036784 -0.0032385 0.029302 -0.0013755 0.0029813 -0.0325247 0.1076909 unknown
polarizability: 100.5725444|4.3446211|71.3480936|11.37626|-0.0633648|67.0979578 unknown
InChI: InChI=1S/C5H9ClN2O/c6-5-1-3-8(7-9)4-2-5/h5H,1-4H2
charge 0 multiplicity 1
18 atoms
Cl -2.749057 0.154409 -1.154825
O  2.970492 0.641165 0.27567
N  0.922006 -0.193809 -0.167818
N  2.249359 -0.420981 0.163816
C  -1.85105 0.113532 0.552341
C  -1.145179 -1.24336 0.701118
C  -0.88309 1.304515 0.625071
C  0.055874 -1.379056 -0.264596
C  0.318263 1.144704 -0.335691
H  -2.688793 0.2213 1.258388
H  -1.858411 -2.068368 0.531239
H  -0.785568 -1.317725 1.747741
H  -0.511177 1.367413 1.667992
H  -1.414769 2.246012 0.403598
H  0.672772 -2.259259 -0.019733
H  -0.317518 -1.481038 -1.301346
H  -0.018229 1.260677 -1.383011
H  1.109375 1.886169 -0.129452
