program: Gaussian 09
title: 000012115
version: EM64L-G09RevD.01
frameworkgroup: C1[X(C9H12N2O)]
method: RPBEPBE
basis: SDD
operation: Freq
keyword: #p
keyword: freq=noraman
keyword: PBEPBE/SDD
title: #p freq=noraman PBEPBE/SDD
converged: YES YES NO NO
title: Mulliken charges:
elementType: O N N C C C C C C C C C H H H H H H H H H H H H
charge: -0.293155 -0.506533 -0.412965 0.469168 -0.336604 0.311506 -0.444732 -0.344090 -0.631913 -0.198828 -0.211495 -0.262697 0.212853 0.212843 0.280316 0.281348 0.209547 0.307797 0.243496 0.243521 0.199545 0.222304 0.222818 0.225951
chargesum: 0.00000
title: Mulliken charges with hydrogens summed into heavy atoms:
elementType: O N N C C C C C C C C C
charge: -0.293155 -0.226217 -0.131617 0.469168 0.089092 0.311506 -0.235185 -0.036294 0.054649 0.023476 0.011322 -0.036747
polarizability: 1.79945398e+02 5.47728630e+00 1.16124540e+02 -3.81076668e-04 2.57095176e-03 5.61421924e+01
1716.lowfreq: -110.5004 -0.0008 -0.0004 0.0003 3.4617 9.1748 16.0586 29.0310 51.1700
frequency: -110.4947 28.3117 51.1460 83.0031 113.4528 221.4067 245.1309 275.0017 284.9189 353.2156 391.7694 407.9962 421.1263 513.7414 594.4520 604.7145 614.4583 695.0058 696.1609 747.7591 763.1931 798.6117 812.0274 837.7063 888.8918 910.4959 967.5104 971.8109 984.4644 998.1188 1027.1638 1087.5982 1089.6415 1125.4772 1141.8164 1170.5218 1186.7607 1232.4965 1272.6593 1290.8324 1315.3113 1345.2005 1381.7392 1405.1618 1426.4799 1462.1500 1472.7055 1486.1134 1487.8275 1507.6768 1530.9904 1598.3147 1618.2164 1658.1720 2952.0886 2990.4994 3001.6275 3099.9873 3100.9888 3128.7526 3132.8960 3139.8219 3163.2908 3196.8718 3519.7644 3533.6274
redmass: 2.0582 3.1431 4.1852 4.0457 4.1652 3.0291 3.8715 1.0904 6.0692 7.1054 1.4191 2.9485 3.8258 2.6956 1.1856 5.5202 6.4231 10.3834 2.0330 5.5143 1.6983 1.1171 4.3899 1.2774 4.8549 1.4240 1.3431 2.8291 5.3854 1.2978 2.1256 1.5473 2.6946 2.5126 1.5065 1.0516 1.1137 2.0635 2.4184 1.0937 1.5152 1.3383 4.8010 1.2094 2.4460 1.0404 1.0582 2.0099 1.2693 2.1208 1.4943 5.4905 5.9897 4.4662 1.0576 1.1051 1.0406 1.0886 1.0950 1.0864 1.1013 1.0932 1.0998 1.0946 1.0764 1.0753
irintensity: 0.6458 2.2672 2.1075 6.5394 0.8744 0.7724 10.4379 0.0257 2.5395 5.8866 7.6873 0.0030 2.8595 46.4468 148.1688 3.6142 1.7615 26.3769 38.5819 2.8774 95.9127 1.7630 0.0009 0.1380 1.2290 14.1187 0.1055 0.2450 1.5007 3.5241 5.2645 15.2145 35.4813 19.8017 6.2776 1.2101 9.4152 375.5311 9.3686 0.2193 65.9336 192.6947 92.4382 35.3739 72.1253 10.3348 53.1836 91.3184 8.4208 319.5681 223.6247 32.6574 67.7661 171.1183 90.8592 42.2005 45.8148 21.8228 36.1401 0.3450 25.3647 35.5149 26.1265 8.4849 5.2196 13.1433
temp: 298.150 k
press: 1.00000 atm
elementType: 8 7 7 6 6 6 6 6 6 6 6 6 1 1 1 1 1 1 1 1 1 1 1 1
symmnumber: 1
zpe: 517724.9 jmol-1
zpe.correction: 0.197191 hartree
zpe.thermalcorrener: 0.208268 hartree
zpe.thermalcorrenthalpy: 0.209213 hartree
zpe.thermalcorrgfe: 0.158997 hartree
zpe.sumelectzpe: -534.005979 hartree
zpe.sumelectthermal: -533.994902 hartree
zpe.sumelectthermalent: -533.993958 hartree
zpe.sumelectthermalfe: -534.044173 hartree
dipole: -1.6346 -4.2274 0.0003
dipole: 4.5324
quadrupole: -59.5415 -63.2205 -76.3466
quadrupole: 6.3263 -0.0007 0.0007
quadrupole: 6.8280 3.1490 -9.9770 6.3263 -0.0007 0.0007
hfenergy: -534.2031701 hartree
pointgroup: C01 [X(C9H12N2O1)]
dipole: 0.6619058 1.6557884 0.0001033 debye
dipolederiv: -0.8650673 0.0193792 -0.0000059 0.1670622 -0.9486975 -0.0000387 -0.000002 -0.0000605 -0.3487017 -2.2365156 -0.0140938 0.00001 0.3315035 -0.2856845 -0.0000318 0.0000286 -0.0000331 -0.3627521 -1.5782958 -0.2912801 0.0000047 -0.5167311 -0.4462462 0.0000404 -0.0000511 0.0000342 -0.5237594 1.5043597 0.2293394 0.0000178 0.5820861 0.0883686 -0.0000023 0.0000323 0.0000025 0.1133017 0.9116387 0.0089181 -0.0000445 -0.1994163 0.1365714 0.0000031 -0.0000308 0.0000009 0.3728891 2.7639244 0.1384174 -0.0000186 -0.2646842 1.3215678 0.0000728 0.0000345 0.0000736 0.2964865 -0.4095557 -0.0781119 0.0000072 0.1636696 0.0673611 -0.0000213 -0.0000169 -0.0000255 -0.2320986 -0.3105186 -0.0297455 -0.0000021 -0.3567189 -0.1128626 -0.0000115 -0.0000008 0.0000069 -0.1777589 0.0244196 0.0383892 -0.0000026 0.0374057 -0.0771258 -0.0000014 -0.000004 0.000002 0.0452939 0.1419507 0.0291806 0.0000029 -0.0713486 0.1268495 -0.0000242 0.0000265 -0.0000238 -0.1411457 0.1568218 -0.0173249 0.0000115 0.0684913 0.1775411 -0.0000257 -0.0000025 -0.0000233 -0.1436229 -0.1008252 0.0510656 0. 0.0552021 -0.1676549 0.000002 -0.0000036 0. -0.2024239 -0.1495801 -0.0394276 0.0616272 -0.0188009 -0.0024721 0.1009308 0.1418852 0.1202458 -0.0903161 -0.1495602 -0.0394467 -0.0616201 -0.0188625 -0.0025132 -0.1009444 -0.1418433 -0.1202615 -0.0902435 0.1141882 0.0027751 0.0000027 -0.0138696 0.0511119 0.0000025 -0.0000242 0.0000112 0.3078947 0.0754604 0.0747165 0.0000087 0.0907414 0.0519377 -0.0000296 -0.0000002 -0.0000261 0.3418337 0.04775 -0.0998405 0.0000035 -0.0716825 -0.1225007 0.0000241 -0.000005 0.0000215 0.1681979 0.1652933 0.0665474 -0.00001 0.0591544 0.0755716 0.0000101 -0.0000147 0.000001 0.1803251 0.1277637 -0.0564412 0.0725305 -0.0163706 0.0310129 0.06367 0.0728404 0.065467 -0.0509578 0.1277894 -0.0564703 -0.0725201 -0.0163968 0.0310026 -0.0636753 -0.0728483 -0.0654633 -0.0508853 -0.2526639 0.0608063 0.00001 0.0169643 0.0774306 0.0000046 0.0000123 0.0000077 0.1083597 -0.0418316 0.1066505 -0.0000134 0.1251524 -0.0224487 0.000018 -0.0000165 0.0000178 0.1568017 0.0640586 -0.0429396 0.0000024 -0.0702943 -0.1183071 0.0000206 0.0000076 0.0000192 0.1511572 -0.1310045 -0.0610631 -0.0000017 -0.0622565 0.0701868 0.0000071 -0.0000034 0.0000057 0.1721245 unknown
polarizability: 180.0613234|4.7527661|116.0086148|0.0003519|-0.0025751|56.1421924 unknown
InChI: InChI=1S/C9H12N2O/c1-2-10-9(12)11-8-6-4-3-5-7-8/h3-7,10-11H,2H2,1H3
charge 0 multiplicity 1
24 atoms
O  1.490089 -1.19413 -0.00017
N  0.262943 0.820622 -0.000014
N  2.592628 0.895918 -0.00004
C  -1.072625 0.3338 -0.000041
C  4.024274 0.50503 -0.00012
C  1.465107 0.07094 -0.000063
C  -2.113946 1.304716 -0.000148
C  -1.408326 -1.047786 0.000055
C  4.332014 -1.003584 0.000029
C  -3.46521 0.905988 -0.000149
C  -2.767559 -1.428514 0.00005
C  -3.804103 -0.467256 -0.000047
H  4.501163 0.963325 -0.891437
H  4.501288 0.963517 0.891029
H  0.340125 1.839747 -0.000035
H  2.439924 1.906386 0.000082
H  -1.862492 2.374278 -0.000234
H  -0.607697 -1.788849 0.000108
H  3.918263 -1.507265 0.886523
H  3.918163 -1.507464 -0.886304
H  5.432116 -1.120853 -0.000018
H  -4.251936 1.66891 -0.000235
H  -3.015261 -2.496368 0.000127
H  -4.853642 -0.77971 -0.000047
