program: Gaussian 09
title: 000127756
version: EM64L-G09RevD.01
frameworkgroup: C1[X(C12H16N2)]
method: RPBEPBE
basis: SDD
operation: Freq
keyword: #pfreq=noraman
keyword: PBEPBE/SDD
title: #p freq=noraman PBEPBE/SDD
converged: YES YES NO YES
title: Mulliken charges:
elementType: N N C C C C C C C C C C C C H H H H H H H H H H H H H H H H
charge: -0.101924 -0.005826 -0.137898 -0.219318 -0.493642 -0.472169 -0.399851 0.327578 -0.552727 0.315233 -0.652007 -0.514261 -0.337096 -0.355425 0.231500 0.209565 0.225299 0.222923 0.208078 0.244205 0.185534 0.226665 0.226562 0.225735 0.182124 0.256842 0.224873 0.258938 0.231786 0.238706
chargesum: 0.00000
title: Mulliken charges with hydrogens summed into heavy atoms:
elementType: N N C C C C C C C C C C C C
charge: -0.101924 -0.005826 0.093602 -0.009754 -0.045421 -0.019885 0.012348 0.327578 -0.100430 0.315233 0.011833 -0.255324 -0.105310 -0.116719
polarizability: 1.68331015e+02 -2.43104778e-01 1.39665643e+02 -4.93872403e+00 -7.30734543e+00 9.23689782e+01
1716.lowfreq: -11.6730 -0.0006 -0.0004 -0.0004 4.9472 9.1397 68.2076 87.8373 115.8817
frequency: 68.0929 87.8371 115.8705 166.5196 202.1453 230.8931 265.9493 275.1544 310.6520 351.5031 366.4154 374.8697 433.5789 480.4794 532.6968 574.1954 600.2145 675.7056 701.5725 727.1659 755.6505 785.7005 817.5387 826.1025 861.1387 888.8560 911.5014 931.0057 938.7462 966.8674 979.8600 984.9858 1034.2246 1040.2671 1048.1624 1067.9933 1109.2444 1120.3428 1148.6751 1161.8944 1166.7386 1187.5436 1198.3056 1207.6242 1214.1806 1234.2222 1235.7354 1245.6626 1264.3924 1286.0907 1303.8995 1309.7078 1324.1996 1339.8238 1344.9957 1348.1822 1365.5331 1407.4743 1433.5936 1448.4941 1463.7304 1468.2885 1470.2743 1478.3066 1478.8468 1491.9695 1558.7460 1580.0024 2803.9527 2842.8319 2854.5271 2956.8313 2991.3375 3002.9082 3013.9729 3024.0868 3026.2943 3029.5228 3057.0362 3071.3985 3084.0993 3109.2913 3120.0174 3145.0105
redmass: 2.8054 3.4888 2.3030 3.2877 2.2667 1.8771 1.4418 3.1092 2.5331 2.8115 4.4401 2.9167 2.7473 4.0861 4.0897 4.8913 3.1141 4.7577 3.5944 3.4403 3.6898 1.9143 2.1796 1.6997 1.6743 3.4962 2.4556 1.4460 2.3705 1.4821 1.6907 2.3165 2.9477 1.8667 2.1161 2.1069 1.3481 1.5954 1.3326 2.0791 2.2212 1.4098 2.9971 1.5657 2.0546 1.4249 1.6301 1.6336 1.4098 1.3280 1.3506 4.0716 1.7001 1.4555 1.4559 1.4271 1.5842 2.2820 1.1652 1.1317 1.0956 1.0563 2.0797 1.0777 1.0584 1.0935 6.6666 6.4278 1.0803 1.0638 1.0656 1.0651 1.0615 1.0755 1.0739 1.0935 1.0736 1.0846 1.1027 1.1043 1.0999 1.0908 1.0871 1.0981
irintensity: 1.3912 0.2203 1.7736 0.0978 0.3900 0.8800 2.7516 1.5745 2.9099 1.1275 0.3342 1.0290 4.2911 3.7092 4.9434 2.7407 3.1147 1.7002 0.7376 2.2951 6.0852 1.7567 33.7867 1.3388 14.9550 9.7435 4.1593 2.8029 3.9036 2.0222 17.4363 6.7592 4.3846 6.1184 2.1313 6.6927 6.9342 5.0647 3.0060 5.0455 5.0013 0.9109 19.2325 4.2652 3.8168 6.0897 4.5090 1.5964 6.3031 19.2302 0.8428 0.3040 2.5286 5.8123 0.2950 4.1914 3.5542 7.7660 4.3435 13.8409 8.9139 17.7379 15.3595 3.4077 12.2646 4.6995 8.6923 29.0164 58.0801 41.2913 228.7024 22.6688 27.1442 29.2224 46.5561 26.8632 34.0920 50.5376 37.1372 45.0298 33.8536 23.7439 6.1522 38.0129
temp: 298.150 k
press: 1.00000 atm
elementType: 7 7 6 6 6 6 6 6 6 6 6 6 6 6 1 1 1 1 1 1 1 1 1 1 1 1 1 1 1 1
symmnumber: 1
zpe: 675351.5 jmol-1
zpe.correction: 0.257228 hartree
zpe.thermalcorrener: 0.268955 hartree
zpe.thermalcorrenthalpy: 0.269899 hartree
zpe.thermalcorrgfe: 0.219824 hartree
zpe.sumelectzpe: -575.319603 hartree
zpe.sumelectthermal: -575.307876 hartree
zpe.sumelectthermalent: -575.306932 hartree
zpe.sumelectthermalfe: -575.357007 hartree
dipole: -2.4468 2.2630 0.1182
dipole: 3.3349
quadrupole: -84.9290 -81.9948 -85.3304
quadrupole: 9.0816 -4.0133 0.1326
quadrupole: -0.8443 2.0899 -1.2457 9.0816 -4.0133 0.1326
hfenergy: -575.5768311 hartree
pointgroup: C01 [X(C12H16N2)]
dipole: 0.9695934 -0.882148 0.0563808 debye
polarizability: 168.2352165|-0.0659668|139.6769485|5.5867595|7.3051556|92.4534715 unknown
InChI: InChI=1S/C12H16N2/c1-14-7-5-10-3-2-9-4-6-13-8-11(9)12(10)14/h4,6,8,10,12H,2-3,5,7H2,1H3
charge 0 multiplicity 1
30 atoms
N  1.664415 0.988223 -0.496691
N  -2.803832 1.416976 0.350606
C  1.576314 -1.042404 0.694899
C  0.868261 0.337701 0.593814
C  3.084275 -0.685266 0.508799
C  1.068155 -1.978616 -0.42646
C  3.083099 0.738538 -0.125973
C  -0.626075 0.257428 0.318837
C  -0.451007 -2.221393 -0.328824
C  -1.243942 -0.935961 -0.148428
C  1.364032 2.394703 -0.795717
C  -1.45768 1.379193 0.571186
C  -2.641912 -0.908002 -0.379907
C  -3.373167 0.272477 -0.136051
H  1.380882 -1.505027 1.681493
H  1.013229 0.898506 1.557114
H  3.578432 -1.424991 -0.145443
H  3.622909 -0.682965 1.472572
H  1.606447 -2.944622 -0.377386
H  1.308344 -1.50753 -1.397956
H  3.444461 1.490173 0.621932
H  3.728974 0.819336 -1.018853
H  -0.665553 -2.881035 0.538959
H  -0.814981 -2.763625 -1.222426
H  1.517659 3.075573 0.081317
H  0.320655 2.499945 -1.13688
H  2.023018 2.741146 -1.612134
H  -1.024524 2.298785 0.985148
H  -3.158892 -1.803931 -0.743149
H  -4.452895 0.315965 -0.319599
