program: Gaussian 09
title: 000012108
version: EM64L-G09RevD.01
frameworkgroup: C1[X(C8H7ClO2)]
method: RPBEPBE
basis: SDD
operation: Freq
keyword: #p
keyword: freq=noraman
keyword: PBEPBE/SDD
title: #p freq=noraman PBEPBE/SDD
converged: YES YES NO NO
title: Mulliken charges:
elementType: Cl O O C C C C C C C C H H H H H H H
charge: -0.006998 -0.321512 -0.166824 0.418022 -0.346421 -0.346726 -0.195113 -0.194937 -0.236861 0.289804 -0.676453 0.247419 0.247309 0.233329 0.233293 0.233933 0.294388 0.294349
chargesum: 0.00000
title: Mulliken charges with hydrogens summed into heavy atoms:
elementType: Cl O O C C C C C C C C
charge: -0.006998 -0.321512 -0.166824 0.418022 -0.099001 -0.099417 0.038215 0.038356 -0.002928 0.289804 -0.087716
polarizability: 1.37110345e+02 4.22576263e-02 8.68212946e+01 -4.41800855e+00 -5.18325476e-02 6.20545225e+01
1716.lowfreq: -41.9401 -15.7420 -8.8433 -0.0026 -0.0025 -0.0016 5.8030 19.9341 62.4806
frequency: -41.7978 19.8480 62.3717 67.2977 191.6454 245.2687 265.3561 378.5596 407.4288 479.5164 530.3723 538.6020 610.2661 647.0263 691.0219 727.5930 754.0103 800.1145 832.8912 881.4568 912.6690 918.7778 968.2066 988.1274 993.9637 1018.5249 1071.7722 1074.7188 1151.2614 1153.6825 1172.5816 1179.2131 1280.9658 1304.0760 1384.4595 1422.3993 1440.9841 1470.0693 1599.6606 1606.8057 1702.1725 3061.8952 3135.6832 3136.6758 3145.2361 3158.8804 3167.9210 3177.0800
redmass: 5.7088 5.0251 3.5777 7.6436 7.8205 7.1395 8.5107 5.3288 2.8571 3.6385 3.1554 9.3402 6.5266 5.2144 2.0580 6.5727 2.2585 3.5308 1.2472 5.0570 1.7907 1.5843 1.3782 5.9088 1.3399 2.1335 4.5389 1.5005 1.1085 2.2884 1.0556 1.3902 1.3823 1.3209 10.2329 1.0850 2.2067 2.2743 6.2484 6.9440 11.3745 1.0572 1.0852 1.1072 1.0891 1.0932 1.0970 1.1015
irintensity: 0.6109 2.1922 6.5181 1.6857 1.4367 0.2580 3.3560 2.4442 0.0072 16.5393 2.8765 7.9268 0.0317 3.6331 31.5512 30.3866 47.9215 34.3089 0.0553 84.5784 7.1935 15.6470 0.0400 14.6767 0.5007 16.1946 472.7672 12.2415 0.4116 100.2855 0.0470 27.4748 21.3954 0.1033 1.0122 34.1800 4.4561 63.3425 27.4385 6.5485 151.5110 9.3143 0.2508 1.0522 7.4850 22.2904 15.4244 6.0755
temp: 298.150 k
press: 1.00000 atm
elementType: 17 8 8 6 6 6 6 6 6 6 6 1 1 1 1 1 1 1
symmnumber: 1
zpe: 340511.7 jmol-1
zpe.correction: 0.129694 hartree
zpe.thermalcorrener: 0.139091 hartree
zpe.thermalcorrenthalpy: 0.140036 hartree
zpe.thermalcorrgfe: 0.092411 hartree
zpe.sumelectzpe: -918.753394 hartree
zpe.sumelectthermal: -918.743997 hartree
zpe.sumelectthermalent: -918.743053 hartree
zpe.sumelectthermalfe: -918.790677 hartree
dipole: -2.5613 -0.0529 -2.4116
dipole: 3.5184
quadrupole: -66.9417 -62.0227 -76.3284
quadrupole: -0.1665 -8.1262 -0.1109
quadrupole: 1.4892 6.4083 -7.8975 -0.1665 -8.1262 -0.1109
hfenergy: -918.8830884 hartree
pointgroup: C01 [X(C8H7Cl1O2)]
dipole: -0.9994646 -0.0209942 -0.9574521 debye
dipolederiv: -0.4312816 -0.0027726 -0.0741549 -0.0057752 -0.1281611 -0.0014125 -0.158304 -0.0017795 -0.168578 -2.113987 -0.0013796 -0.2681382 -0.0004942 -0.2646764 -0.0029939 -0.2406839 -0.0027778 -0.5707297 -0.61751 0.0018033 0.114132 -0.0024339 -0.2456302 -0.0074839 -0.3557255 -0.0060544 -0.8539231 1.2695907 -0.0011768 -0.0312811 -0.0043107 0.2209975 -0.0015518 -0.3795553 -0.0014182 0.0313758 -0.2581523 0.0624476 -0.0400705 0.0999634 -0.0202724 -0.0325736 0.0384768 -0.0006695 -0.119006 -0.2584133 -0.0624161 -0.0390645 -0.0983525 -0.018947 0.030959 0.0394645 -0.0007602 -0.1197292 0.0183159 -0.0626799 -0.0471458 -0.0485372 0.1017675 0.022034 -0.0456607 0.0165823 -0.1222598 0.0186309 0.0621991 -0.0482322 0.0484238 0.100397 -0.0255701 -0.0466259 -0.0200932 -0.1216888 0.0661002 -0.0010583 -0.0754953 -0.0009791 -0.1001149 -0.0001554 -0.0681641 -0.0002141 -0.1424333 1.9107021 -0.0017867 0.1569287 -0.001509 0.1880598 0.0119058 0.6181013 0.0091843 1.2416523 0.32653 0.0089758 0.2782501 0.0172122 0.1539345 -0.0001492 0.5204885 0.0011199 0.0969757 0.0627422 -0.0818274 0.0399545 -0.0819352 -0.0062396 0.0184791 0.0297709 0.0178181 0.1488675 0.063479 0.082333 0.0385348 0.0822313 -0.0077418 -0.0159952 0.0283884 -0.0154281 0.1495466 0.0273747 0.0776422 0.0253391 0.0885748 -0.0593808 -0.0183153 0.034454 -0.0188066 0.152188 0.0266623 -0.0777153 0.0267681 -0.0884151 -0.0580735 0.0217813 0.0360045 0.022261 0.1515002 -0.1011634 0.0009697 0.0694551 0.0010223 0.0895801 0.0003366 0.0744192 0.0003163 0.1459663 -0.0043633 0.0225168 -0.0641622 -0.0024731 0.0310088 0.0781018 -0.06304 0.0646754 0.04645 -0.0052571 -0.026075 -0.0616176 -0.0022125 0.0234925 -0.0773966 -0.0618088 -0.0639558 0.0538254 unknown
polarizability: 137.180845|0.085716|86.8214556|-3.7701476|-0.0386934|61.9838614 unknown
InChI: InChI=1S/C8H7ClO2/c9-6-8(10)11-7-4-2-1-3-5-7/h1-5H,6H2
charge 0 multiplicity 1
18 atoms
Cl 4.614772 0.01664 0.380725
O  0.764556 -0.01131 -0.849579
O  1.658299 0.01259 1.329236
C  -0.597812 -0.004534 -0.381471
C  -1.249611 1.23056 -0.205833
C  -1.254991 -1.233618 -0.184915
C  -2.609552 1.229597 0.178331
C  -2.614931 -1.220079 0.199075
C  -3.29293 0.007877 0.38087
C  1.815263 -0.002852 0.103086
C  3.109665 -0.017203 -0.703016
H  -0.704012 2.16521 -0.368201
H  -0.713642 -2.173346 -0.331469
H  -3.131523 2.18197 0.3195
H  -3.141115 -2.167609 0.35631
H  -4.346723 0.012672 0.678625
H  3.151002 0.863358 -1.361069
H  3.159185 -0.930224 -1.314905
