program: Gaussian 09
title: 000127812
version: EM64L-G09RevD.01
frameworkgroup: C1[X(C19H18F2N8OS)]
method: RPBEPBE
basis: SDD
operation: Freq
keyword: #p
keyword: freq=noraman
keyword: PBEPBE/SDD
title: #p freq=noraman PBEPBE/SDD
converged: YES YES NO NO
title: Mulliken charges:
elementType: S F F O N N N N N N N N C C C C C C C C C C C C C C C C C C C H H H H H H H H H H H H H H H H H H
charge: 0.224994 -0.167168 -0.194022 -0.447650 -0.088719 -0.052483 -0.116284 -0.262958 -0.057119 -0.200819 -0.044381 -0.091956 0.254912 -0.182171 -0.475072 0.194118 -0.711359 -0.677879 0.273558 -0.279664 -0.134811 -0.530825 -0.447872 -0.139327 0.373502 -0.156474 -0.300035 -0.248150 0.247745 -0.152750 -0.278265 0.274902 0.219528 0.233445 0.257567 0.245376 0.228209 0.265481 0.242671 0.415106 0.235085 0.285652 0.266404 0.281498 0.271839 0.258069 0.306181 0.310876 0.271491
chargesum: 0.00000
title: Mulliken charges with hydrogens summed into heavy atoms:
elementType: S F F O N N N N N N N N C C C C C C C C C C C C C C C C C C C
charge: 0.224994 -0.167168 -0.194022 -0.032543 -0.088719 -0.052483 -0.116284 -0.262958 -0.057119 -0.200819 -0.044381 -0.091956 0.254912 -0.182171 0.019358 0.194118 0.025029 0.058482 0.273558 -0.044578 -0.134811 -0.245172 -0.181467 0.142171 0.373502 0.115365 -0.041966 0.058031 0.247745 0.158126 -0.006774
polarizability: 4.35340625e+02 2.23127103e+01 2.10925677e+02 1.03974814e+01 2.51438677e+01 2.48446120e+02
1716.lowfreq: -9.0124 -5.8004 -0.0022 -0.0016 -0.0011 3.1994 7.2578 26.1331 30.7511
frequency: -5.3244 26.0637 30.7242 35.4348 42.1934 50.0392 53.5154 69.6380 76.8133 95.1035 100.4495 135.7231 156.6690 172.8124 180.3768 189.3250 196.4783 217.5189 219.9554 234.4611 252.4422 258.7131 282.7325 289.0484 303.6338 321.9629 325.3481 332.8407 348.4704 359.7669 384.5352 395.1922 409.9029 436.0168 452.3319 469.9209 475.0328 501.4392 511.9947 515.3200 538.3897 550.4541 585.1279 607.9215 629.8022 636.7025 645.8325 657.9017 667.5478 675.3968 711.6496 722.6228 737.2844 738.8136 759.5078 805.9821 810.7896 842.3025 844.1258 852.3869 853.3137 854.8968 861.6296 882.5081 909.3364 913.9559 915.7553 937.0768 937.7407 939.3369 942.2011 950.6278 981.9060 993.0046 994.3195 999.6486 1007.5403 1018.5442 1068.9965 1082.0115 1086.9850 1109.7084 1117.9307 1120.5200 1126.9724 1133.9162 1151.2986 1157.1649 1183.1593 1184.9263 1190.0268 1194.5876 1198.9397 1203.0937 1228.3001 1243.8164 1245.5694 1266.4201 1284.1699 1289.6721 1324.7166 1325.3812 1333.4336 1359.5573 1365.0250 1382.3627 1394.9133 1398.3466 1401.4447 1408.1080 1432.8610 1437.9766 1452.6328 1461.9087 1472.3909 1478.2832 1480.8945 1490.2085 1519.9922 1531.0842 1569.5378 1591.2595 1613.4518 2645.3726 2992.3319 3001.3081 3024.0433 3088.7925 3089.6551 3095.0691 3095.6836 3123.4961 3157.6572 3171.9753 3184.8661 3191.7634 3197.6759 3251.4050 3257.0137 3262.1482 3270.2121
redmass: 8.8821 6.7297 5.5673 5.5649 8.6718 6.3018 7.3990 7.2545 5.4657 4.9092 6.3624 6.9599 5.2786 2.7001 2.8809 3.4343 6.5882 5.9601 5.9268 2.5353 1.3882 4.7804 4.5778 3.2480 4.5507 6.5966 6.1047 5.6242 4.7720 4.3606 5.1107 5.6713 2.6785 3.7388 4.3274 4.9520 4.1550 6.4224 4.5596 6.9057 6.0800 5.7300 4.1994 3.6459 4.4287 4.4671 8.8715 3.3301 3.3618 4.3400 6.7128 4.1033 4.6172 6.2136 8.2847 1.4681 1.4459 1.4134 1.4351 1.5549 2.6061 1.4249 1.5710 2.5393 6.1799 1.2229 5.2551 6.2923 2.0384 1.6121 3.3702 2.1140 2.8069 1.7487 1.3750 4.3108 4.6535 2.7442 3.8424 2.4081 2.8753 2.1891 2.4121 2.3885 1.9525 1.8217 1.6747 2.4656 1.8018 2.6902 2.4099 7.5267 3.1359 1.9551 4.5342 2.9216 2.6210 1.5003 2.0228 4.3745 2.5619 3.8819 1.7776 2.2911 9.1415 1.1901 2.3266 1.2336 3.7704 6.0021 3.2471 4.6860 1.0505 1.0617 1.1842 1.3559 1.0780 1.5500 5.9811 1.1994 5.5365 8.3950 6.9449 1.0820 1.0355 1.0366 1.0621 1.0993 1.0991 1.0988 1.0986 1.0995 1.0879 1.0915 1.0961 1.0937 1.0982 1.0968 1.0978 1.1016 1.1024
irintensity: 0.5646 0.3224 0.5562 0.4611 0.5420 0.2335 0.9307 0.5520 3.9939 0.2944 0.1330 4.9230 2.6537 0.0841 1.7441 1.6154 0.2298 0.2916 1.1017 0.8941 0.2871 2.3872 3.3507 0.9485 8.7532 4.1025 3.1909 0.4875 3.1414 0.4122 8.3984 0.4759 1.0938 1.2751 13.7517 6.3079 10.8577 6.4963 1.6476 35.0876 1.9455 7.8234 7.0577 8.4066 2.3679 0.2626 0.8101 26.1351 22.1667 16.4689 1.8155 4.5845 8.8062 0.6127 9.0467 18.3727 27.5479 21.6342 33.7131 22.7338 10.5146 20.1003 54.6051 19.2561 18.7977 72.4434 8.4348 85.8739 27.5144 11.2323 46.8834 27.5888 23.5288 7.9957 3.0991 1.5548 26.3319 10.0018 13.2225 91.9665 50.1002 68.2804 27.9930 48.0629 4.0205 20.3803 26.7876 56.3561 19.0053 15.2829 10.5260 19.7927 6.2830 16.6441 67.9863 28.7061 38.2367 9.1820 12.9092 11.8749 20.5324 71.3673 6.7520 36.0957 26.5924 22.2761 4.0554 24.1643 18.7981 128.2914 28.2837 268.9589 0.5419 7.4515 32.0888 41.9468 29.0374 33.9221 100.8886 66.1424 16.7920 43.8581 104.9566 1807.2959 11.2487 15.4194 29.8208 7.9626 23.9885 28.5932 4.0682 6.7322 7.0098 0.5297 1.1313 1.6503 1.7546 2.6318 0.0747 0.3875 7.3859
temp: 298.150 k
press: 1.00000 atm
elementType: 16 9 9 8 7 7 7 7 7 7 7 7 6 6 6 6 6 6 6 6 6 6 6 6 6 6 6 6 6 6 6 1 1 1 1 1 1 1 1 1 1 1 1 1 1 1 1 1 1
symmnumber: 1
zpe: 933196.4 jmol-1
zpe.correction: 0.355436 hartree
zpe.thermalcorrener: 0.382206 hartree
zpe.thermalcorrenthalpy: 0.383150 hartree
zpe.thermalcorrgfe: 0.297358 hartree
zpe.sumelectzpe: -1843.478594 hartree
zpe.sumelectthermal: -1843.451824 hartree
zpe.sumelectthermalent: -1843.450879 hartree
zpe.sumelectthermalfe: -1843.536672 hartree
dipole: 1.0169 -6.9435 -5.3619
dipole: 8.8315
quadrupole: -181.0659 -200.0327 -189.3729
quadrupole: 2.2439 -1.8482 1.9099
quadrupole: 9.0913 -9.8756 0.7843 2.2439 -1.8482 1.9099
hfenergy: -1843.8340297 hartree
pointgroup: C01 [X(C19H18F2N8O1S1)]
dipole: 0.9038998 0.4482953 3.3248663 debye
polarizability: 409.3080024|-63.8181893|221.4121404|-43.5415267|-3.7000691|263.9922788 unknown
InChI: InChI=1S/C19H18F2N8OS/c1-18(2,31-17-6-5-16(26-27-17)29-12-23-10-25-29)19(30,8-28-11-22-9-24-28)14-4-3-13(20)7-15(14)21/h3-7,9-12,30H,8H2,1-2H3
charge 0 multiplicity 1
49 atoms
S  0.718599 -0.699093 2.587527
F  -1.170398 2.69103 -0.932069
F  -5.826152 3.672538 -0.580636
O  -0.554579 0.144038 -0.543683
N  -2.288422 -2.016936 -0.420204
N  -1.535433 -3.118785 -0.857736
N  -3.235802 -2.629777 -2.359962
N  1.913058 -0.372356 0.119707
N  2.939017 -0.401282 -0.78374
N  5.174436 -0.833653 -1.337673
N  6.486758 -1.226286 -1.002616
N  6.318349 -0.672278 -3.25589
C  -1.391024 0.116708 0.621007
C  -0.635652 0.614253 1.944931
C  -1.895098 -1.359787 0.827613
C  -2.568229 1.092749 0.332534
C  -1.550869 0.661518 3.19199
C  0.08877 1.957506 1.746179
C  -2.416219 2.271827 -0.448645
C  -3.885752 0.852396 0.813291
C  2.105701 -0.714316 1.427408
C  -3.482378 3.133409 -0.771441
C  -4.982087 1.693083 0.531258
C  -3.285636 -1.746575 -1.332719
C  -4.753065 2.821326 -0.271906
C  3.383673 -1.140944 1.90065
C  -2.156221 -3.44115 -2.025721
C  4.439427 -1.202808 0.991268
C  4.160957 -0.814087 -0.349589
C  5.105667 -0.509481 -2.688873
C  7.120534 -1.1067 -2.195498
H  -1.051966 -1.955636 1.21053
H  -2.715451 -1.430703 1.56242
H  -1.99322 -0.319887 3.437419
H  -2.371688 1.377878 3.016808
H  -0.981159 1.008761 4.071152
H  0.679045 2.206961 2.644406
H  0.744469 1.948964 0.862287
H  -0.655818 2.758702 1.592907
H  0.440399 -0.078067 -0.33912
H  -4.078464 -0.030303 1.429111
H  -3.309466 4.018548 -1.38837
H  -5.983183 1.475703 0.911624
H  -3.994518 -0.930667 -1.239466
H  3.523615 -1.40468 2.951982
H  -1.820094 -4.273173 -2.638453
H  5.446539 -1.51962 1.268672
H  4.191907 -0.180902 -3.173787
H  8.177024 -1.336565 -2.303482
