program: Gaussian 09
title: 000127735
version: EM64L-G09RevD.01
frameworkgroup: C1[X(C24H20O8)]
method: RPBEPBE
basis: SDD
operation: Freq
keyword: #pfreq=noraman
keyword: PBEPBE/SDD
title: #p freq=noraman PBEPBE/SDD
converged: YES YES NO NO
title: Mulliken charges:
elementType: O O O O O O O O C C C C C C C C C C C C C C C C C C C C C C C C H H H H H H H H H H H H H H H H H H H H
charge: -0.440666 -0.315863 -0.198772 -0.360348 -0.423400 -0.240435 -0.430307 -0.463698 0.036322 0.008005 0.352206 0.555347 0.578450 0.013669 -0.721625 0.151968 0.390313 0.021298 -0.699963 -0.314860 -0.642616 -0.651277 0.063318 0.329576 0.282415 -0.677607 0.117870 -0.521128 0.209322 -0.025957 -0.871384 -0.696145 0.294923 0.235553 0.277613 0.280778 0.228001 0.292058 0.271511 0.218327 0.185165 0.386488 0.301518 0.239806 0.239490 0.224025 0.240246 0.192690 0.378296 0.362030 0.374271 0.363183
chargesum: 0.00000
title: Mulliken charges with hydrogens summed into heavy atoms:
elementType: O O O O O O O O C C C C C C C C C C C C C C C C C C C C C C C C
charge: -0.054178 -0.315863 -0.198772 0.017948 -0.061370 -0.240435 -0.056036 -0.100515 0.036322 0.008005 0.352206 0.555347 0.578450 0.013669 -0.426702 0.151968 0.390313 0.021298 -0.186797 -0.314860 -0.361838 -0.423276 0.063318 0.329576 0.282415 -0.385549 0.117870 -0.031290 0.209322 0.159209 -0.090570 -0.039184
polarizability: 5.51942359e+02 -7.72727138e+01 3.64059370e+02 3.00462173e+01 3.20861941e+01 1.56553209e+02
1716.lowfreq: -2.8074 -0.0007 0.0006 0.0007 4.7779 6.0179 15.7413 25.9776 30.0154
frequency: 15.6366 25.9682 30.0127 36.2389 52.5959 58.7149 78.4322 91.9090 108.4276 114.2938 127.3318 143.5559 158.5394 164.5377 171.6682 199.4223 206.5087 213.1077 216.5644 237.7188 263.8840 279.9025 292.8682 309.4679 312.4487 315.9720 323.5463 328.6192 343.0854 351.9151 353.1360 358.9730 370.9366 404.4893 407.0480 411.3320 429.2016 443.7881 459.3425 471.4573 477.8290 494.0337 501.8614 515.5131 541.0966 551.8112 557.6550 590.0945 595.4755 609.4618 614.8098 619.0690 619.5226 654.5055 665.0355 702.2164 708.2409 713.6220 736.5700 755.2492 773.9155 798.8534 808.8458 819.8935 830.4620 841.1811 848.3507 878.5382 905.4859 909.7229 916.6400 926.0696 935.7414 963.1235 977.3494 994.7569 1031.7871 1039.8906 1040.3658 1057.3262 1059.4045 1073.5511 1087.9044 1100.2544 1125.1393 1133.6202 1138.6961 1147.2981 1169.0939 1172.0276 1180.0157 1192.9990 1207.1883 1211.2681 1222.2873 1241.6412 1270.6870 1270.8676 1285.5294 1309.3768 1318.2391 1326.5256 1329.1305 1343.4355 1380.5658 1382.6597 1398.6892 1400.5090 1402.9420 1410.0946 1413.5208 1420.5004 1424.9350 1439.6355 1443.9835 1457.2666 1459.6711 1471.5349 1475.2771 1478.6539 1490.8117 1503.9664 1538.2292 1560.9021 1589.2472 1595.0302 1605.8222 1616.2201 1625.0279 1631.8731 1991.6920 2924.1751 2957.8092 2971.4813 2977.2676 2988.1049 3026.3658 3032.9053 3063.2193 3086.1407 3098.3045 3108.6820 3116.8868 3131.8544 3151.8120 3167.4812 3438.4030 3529.2011 3581.3237 3585.6962
redmass: 6.0634 6.2961 6.2862 4.4495 6.1761 5.7753 7.3843 6.3999 4.1895 4.8451 3.6370 3.6879 2.2624 3.4554 2.4386 5.8232 1.0903 7.1561 5.7593 5.4418 5.5064 4.3894 4.1005 5.6754 4.0565 3.7249 3.4844 3.8439 5.4402 3.3333 4.7173 1.1714 6.7561 1.5070 1.9510 1.4299 2.2914 6.6528 6.4892 3.5996 4.0892 6.9044 7.8289 5.6022 5.7764 9.2529 5.2474 4.8203 4.8977 5.0424 4.0520 5.1310 1.0880 5.6762 4.4788 5.9683 6.1896 4.6540 4.5777 7.3137 3.7002 3.4419 4.0300 3.3607 3.3118 2.6637 1.8352 1.5212 2.5978 2.0220 2.3353 1.7741 2.5173 1.8943 4.2632 7.0380 3.7680 2.2280 1.4930 2.7969 2.1787 1.9115 2.3855 4.0063 1.1817 2.0615 2.3960 1.4897 1.3516 1.6197 1.8356 1.5023 1.9895 1.4295 1.5797 1.9875 1.7045 1.1325 1.6702 3.8790 2.1430 1.2356 4.1767 5.4044 2.5320 1.6521 1.3432 1.3350 5.0899 1.3140 4.2428 3.3165 3.8210 1.6091 3.7376 1.0528 4.1407 2.2300 1.7036 1.0470 1.0438 5.4526 8.8687 5.3723 4.0030 5.2714 6.2263 7.3234 6.8237 6.0965 1.0898 1.0840 1.0415 1.0656 1.0604 1.0361 1.0980 1.0983 1.0914 1.0996 1.0998 1.0912 1.0927 1.0918 1.0918 1.0928 1.0648 1.0648 1.0661 1.0661
irintensity: 2.2433 0.3921 2.8857 1.6020 0.9656 2.2153 0.8374 0.0989 0.7107 3.3768 2.3910 0.6837 0.6266 1.3096 0.6636 0.3966 0.6295 0.8519 0.4848 0.2287 5.0949 8.8154 1.7319 13.4377 13.8350 5.0798 0.9812 8.2611 6.8585 5.5833 11.7140 147.3554 1.4198 135.8758 74.4596 34.5957 9.3098 15.4807 6.2686 9.9571 5.2126 1.8841 3.8496 6.4794 3.8096 42.3387 4.7275 0.1500 4.6184 24.4941 4.5503 1.2670 231.0088 29.4416 0.9477 6.1790 5.2286 3.0402 10.4602 13.0702 16.4440 2.3488 0.9656 5.2985 13.2681 12.4800 6.9464 24.2935 4.6451 1.2867 14.6059 4.5437 4.9185 39.3248 16.4498 28.4949 159.4671 8.0459 2.5068 132.7061 123.3198 65.3031 43.3380 50.6137 84.0082 45.7185 85.7394 345.0312 40.9882 163.6129 8.5071 18.9002 40.5707 14.0654 17.3791 62.6180 34.3752 59.6237 27.1400 561.1899 178.3270 13.9388 21.0840 317.2825 105.0587 41.4499 27.4777 54.7121 36.4386 58.0180 36.8691 286.6405 211.4554 10.9025 56.4646 6.7690 11.6204 92.8348 14.5679 8.3889 18.4851 187.7485 255.0277 94.9299 354.1014 17.2100 78.0310 72.8345 22.3147 264.8076 237.7382 62.1860 25.2127 33.4846 13.7351 25.7767 16.2838 18.2815 1.1025 35.1396 32.7654 23.8666 0.8885 9.1400 0.0209 3.0603 90.3129 54.6686 97.8406 93.7417
temp: 298.150 k
press: 1.00000 atm
elementType: 8 8 8 8 8 8 8 8 6 6 6 6 6 6 6 6 6 6 6 6 6 6 6 6 6 6 6 6 6 6 6 6 1 1 1 1 1 1 1 1 1 1 1 1 1 1 1 1 1 1 1 1
symmnumber: 1
zpe: 1014834.8 jmol-1
zpe.correction: 0.386530 hartree
zpe.thermalcorrener: 0.415272 hartree
zpe.thermalcorrenthalpy: 0.416216 hartree
zpe.thermalcorrgfe: 0.326693 hartree
zpe.sumelectzpe: -1526.116030 hartree
zpe.sumelectthermal: -1526.087288 hartree
zpe.sumelectthermalent: -1526.086344 hartree
zpe.sumelectthermalfe: -1526.175867 hartree
dipole: 1.0877 0.6534 -3.5503
dipole: 3.7702
quadrupole: -120.7472 -192.7536 -192.4042
quadrupole: -20.6485 17.5671 7.9603
quadrupole: 47.8878 -24.1186 -23.7692 -20.6485 17.5671 7.9603
hfenergy: -1526.50256 hartree
pointgroup: C01 [X(C24H20O8)]
dipole: 0.4019787 0.2472216 -1.4062478 debye
polarizability: 554.5008023|-74.385867|363.0476665|23.8982246|31.501781|155.0064689 unknown
InChI: InChI=1S/C24H20O8/c1-9(25)3-13(26)4-11-5-14(27)6-12-7-15-20(23(31)18(11)12)24(32)19-16(22(15)30)8-17(28)10(2)21(19)29/h5-9,25,27-29,31H,3-4H2,1-2H3
charge 0 multiplicity 1
52 atoms
O  -1.339377 -1.078725 -0.869704
O  0.923143 -1.919994 -0.808236
O  2.865816 3.053567 0.663204
O  3.391877 -2.873192 -0.718621
O  -4.424401 4.595219 0.163118
O  -3.807742 -0.970899 1.361598
O  6.992162 0.094113 0.501249
O  -3.748689 -3.708665 1.948364
C  -1.860376 1.245791 -0.36238
C  0.493526 0.37214 -0.290157
C  0.961746 1.679471 0.090789
C  -1.343835 2.547842 0.022686
C  -3.278275 1.095292 -0.574218
C  -0.90788 0.163463 -0.511457
C  0.063043 2.730948 0.239852
C  2.850672 -0.55745 -0.217863
C  3.331832 0.738822 0.164747
C  1.411428 -0.753606 -0.453697
C  -3.922947 -0.220988 -0.966865
C  2.410139 1.910777 0.3297
C  -2.226841 3.651787 0.189308
C  -4.114304 2.208595 -0.399949
C  3.821427 -1.605469 -0.346049
C  -3.597968 3.480039 -0.016763
C  -3.930965 -1.28404 0.14377
C  4.698046 0.96822 0.40463
C  5.208538 -1.387805 -0.104328
C  -4.1409 -2.727049 -0.302156
C  5.622525 -0.087638 0.271238
C  -4.681831 -3.654656 0.815563
C  6.205899 -2.519084 -0.246495
C  -4.85933 -5.096081 0.328873
H  0.44945 3.713095 0.531117
H  -4.98543 -0.048588 -1.239374
H  -3.433871 -0.67025 -1.84773
H  -1.841258 4.632264 0.48261
H  -5.195775 2.090568 -0.551372
H  5.000898 1.981638 0.694192
H  -3.14956 -3.096786 -0.63672
H  -4.803346 -2.749945 -1.190525
H  -5.663978 -3.253471 1.157028
H  -0.421595 -1.699887 -0.909002
H  7.219301 -2.159301 -0.016944
H  5.98931 -3.353453 0.451256
H  6.22788 -2.925885 -1.277843
H  -3.890252 -5.506317 -0.006822
H  -5.227148 -5.725072 1.15726
H  -5.581421 -5.152031 -0.506484
H  4.159103 -3.501574 -0.757856
H  -5.376701 4.3656 0.023988
H  7.185998 1.028967 0.760526
H  -3.607264 -2.764014 2.238743
