program: Gaussian 09
title: 000127736
version: EM64L-G09RevD.01
frameworkgroup: C1[X(C23H20N2O4S)]
method: RPBEPBE
basis: SDD
operation: Freq
keyword: #p
keyword: freq=noraman
keyword: PBEPBE/SDD
title: #p freq=noraman PBEPBE/SDD
converged: YES YES NO NO
title: Mulliken charges:
elementType: S O O O O N N C C C C C C C C C C C C C C C C C C C C C C C H H H H H H H H H H H H H H H H H H H H
charge: 0.231145 -0.262663 -0.264596 -0.415062 -0.210648 -0.173809 -0.117851 0.469981 -0.334096 -0.476402 0.266744 0.406186 0.309396 -0.381038 -0.509682 -0.190110 -0.291471 -0.380963 -0.363239 -0.392636 -0.350411 -0.358067 -0.361522 -0.366326 -0.366203 0.314496 0.310738 0.203394 -0.537974 -0.537292 0.251176 0.265211 0.344595 0.251796 0.247281 0.262979 0.246014 0.248639 0.263079 0.243168 0.251902 0.239071 0.251611 0.382563 0.246730 0.222755 0.223313 0.220522 0.222314 0.245259
chargesum: 0.00000
title: Mulliken charges with hydrogens summed into heavy atoms:
elementType: S O O O O N N C C C C C C C C C C C C C C C C C C C C C C C
charge: 0.231145 -0.262663 -0.264596 -0.032498 -0.210648 -0.173809 -0.117851 0.469981 -0.334096 -0.476402 0.266744 0.406186 0.309396 -0.129861 0.100124 0.061686 -0.044189 -0.117984 -0.117225 -0.143997 -0.087332 -0.114899 -0.109620 -0.127254 -0.114592 0.314496 0.310738 0.203394 0.154824 0.150803
polarizability: 4.92296283e+02 -1.48673801e+01 3.80764999e+02 -2.72660579e+01 -1.87260155e+01 1.72103378e+02
1716.lowfreq: -3.5783 -2.0018 -0.0009 -0.0001 0.0014 2.6713 12.4226 23.6757 26.5156
frequency: 12.2472 23.6674 26.4958 31.9630 32.9914 41.5001 51.8707 54.4066 70.1784 93.4616 97.8258 107.6621 121.5044 135.7779 160.0702 172.8234 190.6170 199.6750 217.6122 236.8971 239.2764 252.2030 264.7302 276.9700 292.1962 331.4869 336.7908 364.4112 387.6726 410.9407 415.2974 420.8468 433.8954 453.4914 459.6880 496.8418 513.6553 522.6188 542.1708 556.6578 559.9467 575.1439 600.6659 616.2762 626.4223 628.5003 630.9375 653.4863 666.8773 683.5099 725.3601 730.3329 735.0618 754.1664 764.4018 769.9303 803.3039 810.2315 815.4890 817.5393 838.0591 840.2654 853.5552 869.2766 878.5593 919.5593 937.0802 946.8655 947.5980 965.0472 968.0106 973.4800 985.8878 987.2748 1001.3858 1005.3026 1036.6383 1053.2935 1081.0076 1092.1721 1112.1733 1112.4555 1113.3233 1121.3145 1156.9219 1157.3912 1171.6656 1177.3526 1183.1291 1203.7246 1230.3930 1235.4964 1237.5602 1245.1508 1267.2807 1302.6038 1304.3896 1315.4811 1326.9013 1355.6404 1362.4437 1367.7715 1400.2575 1421.6798 1422.0976 1425.4779 1431.3624 1435.6551 1436.9251 1453.6021 1465.9969 1467.4093 1468.9200 1472.8762 1476.6174 1491.2418 1504.9201 1535.1357 1567.3925 1573.8328 1583.9304 1617.4201 1621.9760 1686.2664 2948.9529 2959.7116 2961.7110 3047.5048 3050.7168 3053.1659 3125.3025 3126.5652 3133.8634 3145.3650 3146.7454 3150.3537 3165.8740 3166.6138 3170.4664 3172.5177 3207.2705 3218.3242 3242.3688 3524.8644
redmass: 7.5026 7.3298 4.5076 4.2758 5.4824 8.4644 4.7376 4.7698 5.5234 4.3695 4.5526 4.7825 5.1808 4.6941 4.0805 3.9503 4.5966 3.2960 1.4250 5.9235 1.3278 4.1539 3.2660 5.1630 5.2005 6.0499 5.8718 4.2755 7.1132 2.9666 2.9927 4.0525 6.3020 5.0599 4.3384 2.0478 3.1228 3.3135 3.9254 5.6825 6.4063 5.0063 3.1194 5.1865 5.2912 1.6892 5.9487 6.8886 5.0772 6.6433 4.0814 1.2726 4.1843 5.9222 5.1242 5.6650 1.6802 1.9311 1.9188 1.3884 1.6182 1.7534 4.5008 5.8569 1.3664 4.6447 6.8541 1.3872 1.3799 1.3523 1.3535 2.1211 8.7547 8.7384 2.8611 2.4823 2.2735 1.4402 1.5726 3.1331 1.3894 1.2626 1.2601 1.5626 1.3399 1.3280 1.9503 1.2643 1.2719 2.5653 2.8969 2.8443 2.0448 1.8872 1.9558 1.3344 1.3119 3.9483 4.2393 5.0031 2.2801 5.3891 2.1086 3.6189 3.9745 2.7135 3.5028 1.2322 1.1803 1.6225 1.0594 1.0498 1.6361 1.0754 1.4369 3.4331 2.7163 5.6841 7.2321 7.4486 8.4794 6.2826 6.3728 8.5454 1.0694 1.0329 1.0329 1.1039 1.1040 1.0925 1.0994 1.0995 1.0895 1.0872 1.0875 1.0878 1.0956 1.0956 1.0962 1.0972 1.0917 1.0955 1.1090 1.0643
irintensity: 0.1849 0.1467 0.4264 0.8181 0.8436 0.3334 0.4200 0.1701 4.2815 0.1711 1.3645 0.9349 6.7157 5.7614 0.8751 4.7813 2.4258 2.8475 0.4484 2.4691 0.6260 4.5671 4.5233 4.8683 2.3168 1.5144 0.9158 6.8877 13.1383 0.3317 0.2518 4.1010 3.7585 3.0890 0.5291 35.3841 2.4991 10.8728 52.5061 14.3209 14.5852 27.7994 24.6601 5.2981 3.5859 114.8686 9.8036 9.7232 13.0089 3.4812 0.8062 87.5408 5.4684 10.5946 45.2491 0.4669 16.5084 43.3124 5.3239 16.0551 24.5206 89.1781 4.9365 5.6612 0.3782 24.0169 28.7200 1.4810 1.4801 0.8339 0.3307 0.9044 53.1416 48.2468 7.2485 9.2541 276.2676 63.7932 56.1380 13.0245 2.7067 0.1383 0.1682 9.9633 1.6692 1.4360 5.4587 129.8996 130.9616 3.9052 192.8381 236.6187 21.3724 10.6070 21.8535 6.0088 5.9484 19.5471 38.1851 15.6779 8.9563 7.2769 40.6970 1.2336 13.9185 17.5750 38.4299 25.8557 12.2634 58.6050 26.0925 12.5902 213.3370 65.4243 19.5678 119.9250 110.8151 12.6424 9.9494 30.9733 122.4528 124.2652 77.4824 181.3615 210.3199 84.8298 79.6727 46.9536 44.6988 7.8708 29.2766 30.7921 8.2007 9.6523 10.7735 6.6017 17.0750 10.1724 5.3987 3.2891 6.8201 1.2556 2.7495 29.8851
temp: 298.150 k
press: 1.00000 atm
elementType: 16 8 8 8 8 7 7 6 6 6 6 6 6 6 6 6 6 6 6 6 6 6 6 6 6 6 6 6 6 6 1 1 1 1 1 1 1 1 1 1 1 1 1 1 1 1 1 1 1 1
symmnumber: 1
zpe: 992534.5 jmol-1
zpe.correction: 0.378036 hartree
zpe.thermalcorrener: 0.405757 hartree
zpe.thermalcorrenthalpy: 0.406701 hartree
zpe.thermalcorrgfe: 0.315751 hartree
zpe.sumelectzpe: -1694.764978 hartree
zpe.sumelectthermal: -1694.737258 hartree
zpe.sumelectthermalent: -1694.736314 hartree
zpe.sumelectthermalfe: -1694.827264 hartree
dipole: -1.2925 3.7377 -2.7850
dipole: 4.8371
quadrupole: -150.3226 -161.3099 -183.4711
quadrupole: 7.2960 0.2754 -4.1434
quadrupole: 14.7119 3.7246 -18.4365 7.2960 0.2754 -4.1434
hfenergy: -1695.1430143 hartree
pointgroup: C01 [X(C23H20N2O4S1)]
dipole: 0.5726128 1.4031248 1.1510588 debye
polarizability: 495.7112192|-2.5237873|379.2620764|11.3625218|19.7747332|170.191365 unknown
InChI: InChI=1S/C23H20N2O4S/c1-28-17-9-5-15(6-10-17)21-22(16-7-11-18(29-2)12-8-16)30-23(24-21)19-4-3-13-25(19)14-20(26)27/h3-13,26H,14H2,1-2H3
charge 0 multiplicity 1
50 atoms
S  -0.778566 -2.64622 -0.13007
O  5.922847 -3.35152 0.194225
O  2.695793 4.94358 -0.034698
O  -4.532976 2.7916 -1.544839
O  -4.876223 0.733759 -2.578651
N  -4.419721 -0.573589 -0.032419
N  -1.414091 -0.074558 0.102774
C  -3.407253 -1.559518 0.017092
C  -1.991612 -1.271535 0.016208
C  0.548647 -1.396146 -0.042035
C  -0.009014 -0.111388 0.051589
C  1.942967 -1.862998 0.022859
C  0.704427 1.189631 0.053338
C  -4.052624 -2.814484 0.095571
C  -4.227507 0.868474 -0.17217
C  -5.660381 -1.202543 0.00317
C  -5.46186 -2.588951 0.086588
C  2.877325 -1.266642 0.913531
C  2.390495 -2.961866 -0.770163
C  0.153358 2.288845 0.76056
C  1.904969 1.402549 -0.683168
C  4.208193 -1.723249 0.99992
C  3.710433 -3.432064 -0.689383
C  0.778632 3.554072 0.765472
C  2.538101 2.655451 -0.689935
C  4.630005 -2.810871 0.193493
C  1.981425 3.737652 0.03901
C  -4.58918 1.388828 -1.559707
C  6.91337 -2.74245 1.08634
C  2.14898 6.097314 0.683247
H  -3.545068 -3.776029 0.165924
H  -4.822621 1.420489 0.576827
H  -3.156853 1.092954 0.008481
H  -6.581314 -0.624448 -0.048498
H  -6.24532 -3.342492 0.135867
H  2.554799 -0.438946 1.552654
H  1.693491 -3.440606 -1.4677
H  -0.781089 2.143753 1.312113
H  2.336961 0.583813 -1.266235
H  4.893945 -1.236901 1.700055
H  4.05428 -4.271753 -1.300583
H  0.323959 4.375443 1.32732
H  3.455478 2.824788 -1.261719
H  -4.719223 3.137978 -2.458936
H  7.840561 -3.30795 0.91337
H  6.611308 -2.836818 2.147422
H  7.074938 -1.675318 0.838956
H  2.093696 5.904571 1.772462
H  1.144593 6.368206 0.303528
H  2.85382 6.918499 0.487043
