program: Gaussian 09
title: 000127663
version: EM64L-G09RevD.01
frameworkgroup: C1[X(C13H14N2O2S)]
method: RPBEPBE
basis: SDD
operation: Freq
keyword: #p
keyword: freq=noraman
keyword: PBEPBE/SDD
title: #p freq=noraman PBEPBE/SDD
converged: YES YES NO NO
title: Mulliken charges:
elementType: S O O N N C C C C C C C C C C C C C H H H H H H H H H H H H H H
charge: 0.254165 -0.239939 -0.270796 -0.116749 -0.025687 -0.298910 -0.676392 -0.207366 0.118637 -0.359845 0.267548 0.145066 -0.529335 0.326111 -0.342281 -0.375003 -0.539123 -0.538197 0.238297 0.248687 0.265199 0.286622 0.280762 0.250298 0.237892 0.246702 0.219400 0.245953 0.211747 0.214227 0.219952 0.242358
chargesum: 0.00000
title: Mulliken charges with hydrogens summed into heavy atoms:
elementType: S O O N N C C C C C C C C C C C C C
charge: 0.254165 -0.239939 -0.270796 -0.116749 -0.025687 0.188074 -0.124571 -0.207366 0.118637 -0.079082 0.267548 0.145066 -0.279037 0.326111 -0.104389 -0.128301 0.137976 0.138340
polarizability: 2.56750454e+02 -1.75222165e+00 1.93608486e+02 2.65232421e+00 -1.06005622e+01 1.04552560e+02
1716.lowfreq: -13.2351 -4.7885 -0.3259 -0.0010 0.0011 0.0012 22.0268 48.7314 60.1444
frequency: 20.8035 48.7229 60.1441 62.0939 101.5203 127.9297 142.5686 159.7415 189.0699 208.1169 211.6961 240.1700 249.0126 264.2226 288.2341 320.5130 371.4732 406.7944 435.7751 458.3862 471.0076 484.8310 526.6391 576.7133 607.7949 623.6077 635.9345 660.6677 676.4290 702.5036 719.3941 738.3515 755.4680 805.7660 839.8403 861.9559 866.1312 924.8993 926.7824 970.1259 986.3449 1001.1728 1008.9224 1040.8452 1071.8126 1109.8892 1113.0813 1123.5009 1144.3812 1153.3098 1160.6684 1172.7015 1174.1916 1197.2250 1230.4126 1246.6697 1259.3342 1288.9890 1290.3195 1356.5456 1366.7435 1387.0562 1405.6517 1424.4445 1436.0491 1438.8522 1450.3656 1464.5628 1466.5576 1467.8240 1473.6457 1477.4192 1486.0977 1538.9091 1597.6242 1613.6091 2949.4268 2950.3486 2987.9252 3034.0877 3035.5738 3050.0885 3066.8807 3117.3988 3120.7560 3139.7536 3152.1245 3155.4896 3173.0797 3244.4454
redmass: 5.3506 5.0317 3.1433 4.2196 3.7702 3.3770 3.7466 4.0936 4.7987 2.4471 1.8656 1.5036 1.8343 2.9185 3.7967 5.6299 5.2689 5.6744 4.6711 4.5066 6.2874 3.9709 5.8250 3.8847 4.2860 4.3364 4.4842 5.2943 3.7324 2.7553 2.8107 3.6522 2.7368 1.5456 6.6098 1.6941 1.6540 6.1821 1.3838 2.5583 8.1960 6.7207 1.4559 2.4492 5.2312 1.2589 1.2603 1.4247 1.4997 1.4190 1.3206 1.3788 1.3710 2.7687 4.3618 2.7463 1.5528 1.4312 1.8494 5.3747 2.9431 5.2693 2.8402 8.3618 1.3208 1.2227 1.1165 1.0524 1.0995 1.2222 1.0577 1.1807 1.6656 5.6249 8.8072 6.4398 1.0335 1.0336 1.0628 1.1035 1.1032 1.0669 1.0929 1.0986 1.0985 1.1087 1.0870 1.0905 1.0964 1.0998
irintensity: 4.1320 2.2103 10.6480 0.4557 0.7033 1.3719 6.1993 4.1018 1.6075 0.1676 0.6459 0.8475 1.8195 2.1870 2.6885 0.5628 0.1267 0.1882 1.4924 4.5146 2.3302 5.3336 8.4974 3.4960 2.0189 4.2330 4.4191 4.7491 7.0323 47.5460 7.2153 2.0212 12.8113 53.3606 21.0845 15.3196 13.3719 2.3089 0.3740 0.8472 22.4798 82.3296 0.5316 15.5927 13.7602 0.6117 0.2149 24.8530 18.0939 2.9806 0.6724 4.5666 19.5996 271.7996 34.2788 19.0590 22.2705 14.0931 29.9420 81.3823 12.8133 17.3650 104.2430 133.8561 14.4363 2.2039 10.6599 15.5101 60.7889 146.3043 14.3049 2.7860 55.8726 29.6363 2.1724 27.9455 151.9558 2.9270 58.7079 50.6682 55.4850 13.2082 29.0535 32.6218 20.6531 11.0472 10.6034 6.7084 11.5586 1.4980
temp: 298.150 k
press: 1.00000 atm
elementType: 16 8 8 7 7 6 6 6 6 6 6 6 6 6 6 6 6 6 1 1 1 1 1 1 1 1 1 1 1 1 1 1
symmnumber: 1
zpe: 649242.9 jmol-1
zpe.correction: 0.247284 hartree
zpe.thermalcorrener: 0.264194 hartree
zpe.thermalcorrenthalpy: 0.265138 hartree
zpe.thermalcorrgfe: 0.201278 hartree
zpe.sumelectzpe: -1160.431203 hartree
zpe.sumelectthermal: -1160.414293 hartree
zpe.sumelectthermalent: -1160.413349 hartree
zpe.sumelectthermalfe: -1160.477209 hartree
dipole: 2.3487 -3.4365 2.8046
dipole: 5.0191
quadrupole: -99.7889 -89.3785 -115.9785
quadrupole: -15.3327 7.5008 -0.2999
quadrupole: 1.9264 12.3368 -14.2632 -15.3327 7.5008 -0.2999
hfenergy: -1160.6784869 hartree
pointgroup: C01 [X(C13H14N2O2S1)]
dipole: -1.0059846 1.3469496 1.0358822 debye
polarizability: 256.8279189|0.1119467|194.047667|2.066371|8.1890201|104.035914 unknown
InChI: InChI=1S/C13H14N2O2S/c1-16-9-3-4-12(17-2)10(7-9)11-8-15-5-6-18-13(15)14-11/h3-4,7-8H,5-6H2,1-2H3
charge 0 multiplicity 1
32 atoms
S  -4.420061 -0.666911 -1.062704
O  0.604323 -2.481729 0.333273
O  3.92465 2.042691 -0.263123
N  -2.716299 0.832733 0.37281
N  -1.52887 -0.729183 -0.783148
C  -4.011851 1.346125 0.838261
C  -5.017167 0.983933 -0.288204
C  -2.738603 -0.23068 -0.530142
C  -0.649933 0.048897 0.02292
C  -1.377725 1.013447 0.741713
C  0.818705 -0.108244 0.008875
C  1.450184 -1.381534 0.132151
C  1.634755 1.046984 -0.118864
C  3.045182 0.947714 -0.136827
C  2.864863 -1.476116 0.091862
C  3.658714 -0.320773 -0.040779
C  1.217893 -3.806877 0.39039
C  3.325072 3.369033 -0.391956
H  -3.977364 2.438798 0.990726
H  -4.293675 0.860572 1.792879
H  -6.034996 0.830169 0.097739
H  -5.01765 1.741177 -1.087117
H  -1.057673 1.758699 1.46371
H  1.135302 2.012634 -0.242449
H  3.359762 -2.447762 0.17561
H  4.75047 -0.385015 -0.073993
H  1.76018 -4.04273 -0.546442
H  0.375772 -4.503659 0.514532
H  1.909273 -3.901391 1.252093
H  2.716023 3.62755 0.497478
H  2.697092 3.444473 -1.30197
H  4.174251 4.064276 -0.471603
