program: Gaussian 09
title: 000127659
version: EM64L-G09RevD.01
frameworkgroup: C1[X(C18H24O3)]
method: RPBEPBE
basis: SDD
operation: Freq
keyword: #pfreq=noraman
keyword: PBEPBE/SDD
title: #p freq=noraman PBEPBE/SDD
converged: YES YES NO NO
title: Mulliken charges:
elementType: O O O C C C C C C C C C C C C C C C C C C H H H H H H H H H H H H H H H H H H H H H H H H
charge: -0.283182 -0.447906 -0.232351 -0.145960 -0.128174 0.404475 -0.083504 -0.229099 -0.523381 -0.518636 -0.194761 -0.548726 -0.170157 -0.486147 -0.458077 0.561127 -0.639361 -0.255089 -0.815776 -0.610768 0.234438 0.223249 0.229797 0.238683 0.236861 0.196776 0.231129 0.221585 0.203825 0.202954 0.213234 0.231078 0.246850 0.228479 0.224641 0.229090 0.202371 0.223626 0.235661 0.257673 0.210223 0.224498 0.259756 0.259496 0.339482
chargesum: 0.00000
title: Mulliken charges with hydrogens summed into heavy atoms:
elementType: O O O C C C C C C C C C C C C C C C C C C
charge: -0.283182 -0.108424 -0.232351 0.077289 0.101623 0.404475 0.155179 0.007761 -0.095476 -0.093226 0.008193 -0.104413 0.076693 -0.033026 -0.026616 0.561127 -0.180075 0.002584 -0.121299 -0.351273 0.234438
polarizability: 2.52107754e+02 -1.65859694e+00 1.76949891e+02 -1.82008396e+01 -2.68730271e-01 1.52846259e+02
1716.lowfreq: -19.6799 -6.7823 -1.8361 -0.0007 -0.0005 0.0003 32.3719 46.6933 83.0939
frequency: 32.2846 46.5787 83.0898 117.1044 129.7382 149.1369 165.2436 193.2336 211.6672 225.4676 236.9958 249.5620 259.1365 268.2928 282.0044 293.2845 329.3821 346.3413 364.4293 377.6698 406.1352 436.5665 445.7413 460.2395 469.4949 488.1401 533.0942 539.9371 547.9356 597.2853 605.8009 623.7505 682.8492 705.6739 716.4731 747.6088 793.6063 807.8412 829.9338 833.9988 838.3417 862.6819 879.3668 897.5078 907.9259 920.0231 944.4778 951.7214 976.6931 985.5359 991.0886 1003.2381 1008.3431 1021.2594 1038.3854 1039.8873 1050.4207 1063.8008 1070.5312 1084.6906 1094.2766 1109.5576 1129.7148 1133.2868 1146.3053 1157.0326 1164.2358 1176.5189 1177.9541 1208.3551 1214.5918 1220.3051 1226.8508 1235.5548 1246.2988 1260.1270 1269.8285 1276.3440 1283.1391 1290.5087 1300.4848 1303.3820 1313.6962 1317.3746 1324.5767 1330.1557 1334.8047 1338.7471 1344.2454 1350.6126 1362.4581 1368.3413 1377.4342 1384.5377 1399.8700 1460.4479 1462.5512 1465.5110 1467.1518 1472.3670 1478.8730 1490.5270 1494.0273 1581.4550 1642.4340 2910.2800 2929.2804 2935.3542 2942.9974 2957.9937 2962.0125 2966.4058 2973.9994 2977.2056 2993.8046 2996.8531 3008.1335 3032.3920 3038.6650 3039.9921 3048.0321 3052.0155 3071.2536 3084.3531 3096.4284 3114.9585 3132.3424 3135.5399 3574.9768
redmass: 6.7553 4.1764 4.5818 4.6859 2.6877 2.3301 4.6127 2.2141 2.5263 1.9798 2.8198 1.3122 2.1510 2.7540 4.4350 3.0569 3.1847 3.2761 2.3805 3.4641 3.6912 4.1824 3.6116 2.9928 4.2345 3.9047 3.1333 2.9296 4.9675 2.7851 3.8917 3.6620 2.8366 4.1102 2.4896 4.9578 4.0434 2.3303 2.1463 1.5915 2.0825 2.1424 2.5713 1.6289 2.3342 2.4393 2.0111 2.2902 2.3047 2.3439 2.0423 2.0366 2.2001 2.0890 2.7082 2.0087 1.5625 2.3314 3.0942 1.7825 1.4442 1.7322 1.6338 1.9671 1.8511 1.7930 1.8881 1.3344 1.3393 1.5022 1.2685 1.3640 1.3518 1.6290 1.3737 1.4027 1.4779 1.3938 1.4208 1.3706 1.3160 1.4806 1.4589 1.5192 1.4098 1.3980 1.9133 1.3590 1.4986 1.7747 2.3149 1.7720 2.2537 1.3174 1.3116 1.0753 1.0953 1.0933 1.0797 1.0800 1.0849 1.0754 1.0619 9.3347 7.6577 1.0802 1.0840 1.0789 1.0823 1.0816 1.0649 1.0654 1.0617 1.0623 1.0590 1.0373 1.0622 1.0954 1.1003 1.1002 1.1028 1.0984 1.1041 1.0982 1.0989 1.0874 1.0915 1.0936 1.0663
irintensity: 2.2629 0.6577 0.5454 1.4497 1.8648 0.3851 4.8658 3.2772 6.7729 11.5725 8.6861 69.5613 40.4636 1.8271 3.3914 7.5101 2.8520 11.8866 3.7832 2.6672 1.2824 0.9396 2.3692 1.1386 7.0282 5.7726 4.3000 6.2720 3.8165 4.6473 0.9711 1.7436 8.4430 13.1817 7.5188 6.0887 20.0515 0.5088 1.5311 6.5039 3.2729 6.1209 16.2936 13.3862 1.1738 12.2180 9.6897 14.1243 3.6765 72.6756 10.4894 5.1646 2.8419 17.6219 11.0236 7.4449 15.5216 3.4028 2.5825 9.8411 1.5841 1.5010 17.0668 1.2990 1.5567 10.9123 2.9984 2.6282 20.2070 11.3986 1.0092 18.2210 0.9594 2.0526 9.1165 2.0236 27.0967 2.5632 0.0024 2.9633 1.9353 2.2878 9.4072 5.8142 3.9000 0.7556 14.0035 0.7419 0.8716 4.4641 12.7371 2.5580 5.9276 8.2379 17.8773 6.2856 11.7617 7.8907 7.6036 12.7110 1.9097 10.6386 6.8050 186.9465 189.1911 2.9347 51.6846 3.1386 0.2949 20.5173 47.6098 20.3624 24.1161 54.0246 29.2161 27.7687 45.4022 34.1248 18.1375 78.4151 4.5801 33.6700 68.0386 34.1394 16.9466 12.0063 18.1339 10.8226 4.1879
temp: 298.150 k
press: 1.00000 atm
elementType: 8 8 8 6 6 6 6 6 6 6 6 6 6 6 6 6 6 6 6 6 6 1 1 1 1 1 1 1 1 1 1 1 1 1 1 1 1 1 1 1 1 1 1 1 1
symmnumber: 1
zpe: 1006841.7 jmol-1
zpe.correction: 0.383486 hartree
zpe.thermalcorrener: 0.402040 hartree
zpe.thermalcorrenthalpy: 0.402984 hartree
zpe.thermalcorrgfe: 0.338144 hartree
zpe.sumelectzpe: -924.333903 hartree
zpe.sumelectthermal: -924.315349 hartree
zpe.sumelectthermalent: -924.314405 hartree
zpe.sumelectthermalfe: -924.379245 hartree
dipole: -6.6725 1.5993 -0.1793
dipole: 6.8638
quadrupole: -157.7854 -121.5214 -128.7275
quadrupole: -4.4472 11.2777 4.7565
quadrupole: -21.7739 14.4901 7.2839 -4.4472 11.2777 4.7565
hfenergy: -924.7173888 hartree
pointgroup: C01 [X(C18H24O3)]
dipole: -2.6229552 -0.6403966 0.0480896 debye
polarizability: 251.9237088|1.6516891|176.9638833|18.6875739|0.2002743|153.0163122 unknown
InChI: InChI=1S/C18H24O3/c1-18-7-6-11-10(12(18)4-5-14(18)20)3-2-9-8-13(19)16-17(21-16)15(9)11/h8,10-12,14-17,20H,2-7H2,1H3
charge 0 multiplicity 1
45 atoms
O  3.788184 1.516255 -1.124088
O  -5.169109 1.276971 0.500657
O  5.095396 -0.22587 1.688203
C  -2.068046 -0.747096 0.292735
C  -0.709392 -0.815301 -0.429826
C  -2.825314 0.59234 0.030181
C  0.184179 0.368189 0.076642
C  1.570136 0.326728 -0.673573
C  -1.957356 1.752443 0.5675
C  -0.535199 1.740516 -0.05988
C  -4.1206 0.304357 0.834062
C  -3.133648 -1.846909 0.033358
C  2.485386 1.504649 -0.367604
C  -0.006321 -2.176162 -0.224827
C  -4.481281 -1.175894 0.476371
C  2.218721 -1.027876 -0.416706
C  1.399545 -2.207806 -0.890416
C  3.776847 1.316676 0.385301
C  -3.187728 0.82486 -1.460368
C  3.383395 -1.187026 0.288111
C  4.158377 -0.066441 0.84509
H  -1.843629 -0.768688 1.38516
H  -0.874482 -0.679572 -1.521358
H  0.381019 0.191094 1.157512
H  1.333663 0.386598 -1.759972
H  -1.865467 1.65468 1.669987
H  -2.442906 2.727192 0.37096
H  -0.59233 2.019012 -1.131661
H  0.060421 2.530042 0.43621
H  -3.884233 0.376987 1.920314
H  -2.920779 -2.769272 0.602104
H  -3.161878 -2.124677 -1.037266
H  2.017323 2.49471 -0.330086
H  -0.62815 -2.989601 -0.643872
H  0.102121 -2.374736 0.861048
H  -5.214375 -1.172177 -0.351303
H  -4.944798 -1.703204 1.330114
H  1.270485 -2.150234 -1.991487
H  1.912774 -3.160005 -0.666572
H  4.21938 2.142689 0.954159
H  -2.294108 1.004093 -2.082585
H  -3.731131 -0.03192 -1.895996
H  -3.847712 1.705024 -1.538957
H  3.769628 -2.190243 0.505735
H  -5.976607 1.078703 1.037092
