program: Gaussian 09
title: 000127634
version: EM64L-G09RevD.01
frameworkgroup: C1[X(C11H10Cl3NO3S)]
method: RPBEPBE
basis: SDD
operation: Freq
keyword: #p
keyword: freq=noraman
keyword: PBEPBE/SDD
title: #p freq=noraman PBEPBE/SDD
converged: YES YES NO NO
title: Mulliken charges:
elementType: Cl Cl Cl S O O O N C C C C C C C C C C C H H H H H H H H H H
charge: -0.025687 0.011566 0.013868 0.256677 -0.425371 -0.217889 -0.278667 -0.382657 -0.103879 -0.700245 0.174186 -0.119104 0.262290 -0.160826 -0.135497 -0.085949 -0.187531 -0.085400 -0.768997 0.301431 0.314375 0.295753 0.350318 0.283551 0.288816 0.255992 0.255344 0.218031 0.395502
chargesum: 0.00000
title: Mulliken charges with hydrogens summed into heavy atoms:
elementType: Cl Cl Cl S O O O N C C C C C C C C C C C
charge: -0.025687 0.011566 0.013868 0.256677 -0.029869 -0.217889 -0.278667 -0.032338 0.197551 -0.090117 0.174186 -0.119104 0.262290 -0.160826 0.148054 -0.085949 0.101286 -0.085400 -0.039630
polarizability: 2.34608419e+02 6.88916023e+00 1.74844932e+02 -3.33838119e+01 8.09722866e+00 1.24856876e+02
1716.lowfreq: -6.1661 -0.6633 -0.0019 -0.0016 -0.0010 4.5016 14.7185 22.0498 35.0694
frequency: 14.6491 21.7763 35.0367 44.1160 51.8621 63.3478 76.0778 79.5272 97.5841 126.9242 149.1006 174.8228 188.0473 193.4796 199.5114 226.5840 257.8958 300.3047 320.3040 326.8186 353.3601 365.1650 444.8834 454.8004 467.2510 478.7477 504.2437 513.2094 556.1395 581.5357 591.3837 601.2426 605.4820 621.2500 651.1895 664.7395 683.7895 720.2201 805.2921 811.9958 856.3521 882.9878 907.7475 940.8147 978.6185 996.2843 1005.1572 1042.6065 1078.5902 1101.9488 1136.1422 1139.5522 1182.7281 1227.7529 1233.7502 1244.1358 1285.4079 1297.8329 1315.2123 1329.9748 1352.0195 1388.6833 1418.0053 1421.4572 1449.3237 1464.5951 1483.4733 1541.9391 1560.3632 1606.1013 1669.4915 2967.9732 2998.2647 3049.9042 3095.8800 3106.9306 3133.1876 3167.9636 3180.6475 3524.4441 3551.6257
redmass: 8.5156 9.6921 10.3841 10.0108 10.5086 4.3953 3.5562 2.9618 1.8225 5.9719 6.0406 23.1095 14.1845 6.8054 13.5229 7.2825 4.3403 19.3492 4.2128 14.0014 4.3489 5.7132 3.3365 3.9170 6.5512 6.1743 3.8451 4.1070 1.4427 6.5325 4.8545 5.6421 2.5793 2.7664 2.0188 7.1802 3.9046 4.6086 10.6052 3.4046 1.4325 1.4052 2.5154 4.6143 2.9554 1.5516 9.1491 1.6558 1.8032 1.6097 8.0999 2.1044 1.5340 1.3059 1.1997 1.4596 1.7678 6.7419 1.5544 2.0293 10.3098 1.2276 1.3955 1.7376 1.0659 1.1420 1.9023 9.9075 8.0646 6.1733 9.4076 1.0803 1.0360 1.0576 1.0985 1.1004 1.1082 1.0924 1.0932 1.0643 1.0790
irintensity: 0.4324 2.0375 0.4354 2.7683 4.3363 12.5018 0.0923 0.7814 0.7649 2.4935 4.2166 0.5268 0.7364 0.0500 0.7396 2.3212 1.1457 0.4590 1.7646 0.3888 1.3296 0.7074 7.5959 20.6771 14.8597 2.4589 30.5014 38.8362 134.3923 15.0079 74.5647 15.4974 6.9811 64.3523 96.0651 2.9477 0.4888 19.4276 3.2066 11.1408 8.3283 25.9246 19.0132 10.9283 59.2086 4.5216 94.6242 16.6550 175.6033 26.5914 14.5555 13.9845 10.0727 1.2125 1.3501 14.1439 32.8651 35.8196 22.1047 29.0318 1.9080 56.9206 103.6001 72.8471 32.2645 77.4353 162.4408 1.7124 4.0238 123.6820 221.9574 15.9693 5.9293 4.8391 11.2247 11.3754 0.7104 0.5497 1.0378 40.3126 44.8168
temp: 298.150 k
press: 1.00000 atm
elementType: 17 17 17 16 8 8 8 7 6 6 6 6 6 6 6 6 6 6 6 1 1 1 1 1 1 1 1 1 1
symmnumber: 1
zpe: 506855.1 jmol-1
zpe.correction: 0.193051 hartree
zpe.thermalcorrener: 0.213584 hartree
zpe.thermalcorrenthalpy: 0.214528 hartree
zpe.thermalcorrgfe: 0.139546 hartree
zpe.sumelectzpe: -2482.443486 hartree
zpe.sumelectthermal: -2482.422953 hartree
zpe.sumelectthermalent: -2482.422009 hartree
zpe.sumelectthermalfe: -2482.496991 hartree
dipole: 1.3134 3.1750 0.3569
dipole: 3.4545
quadrupole: -140.2857 -135.9981 -145.2655
quadrupole: 6.4951 3.8143 8.6210
quadrupole: 0.2307 4.5184 -4.7491 6.4951 3.8143 8.6210
hfenergy: -2482.6365365 hartree
pointgroup: C01 [X(C11H10Cl3N1O3S1)]
dipole: -0.4229705 -0.4070285 1.2257917 debye
polarizability: 227.4257631|42.9932927|134.4078201|5.377104|-13.5148747|172.4766439 unknown
InChI: InChI=1S/C11H10Cl3NO3S/c1-5(16)15-9(11(17)18)4-19-10-3-7(13)6(12)2-8(10)14/h2-3,9,15,17H,4H2,1H3
charge 0 multiplicity 1
29 atoms
Cl 0.117053 -1.905415 2.105416
Cl 4.018597 0.769194 -2.248057
Cl 4.924895 0.499908 0.911257
S  -0.796921 -1.778435 -1.124174
O  -3.761528 -0.731548 1.251008
O  -4.459683 -1.063986 -0.939957
O  -1.011927 2.743872 -0.484126
N  -1.753631 0.855106 0.629234
C  -2.552612 0.428566 -0.518149
C  -1.707776 -0.197446 -1.659645
C  -3.683292 -0.520908 -0.128512
C  0.788609 -1.08042 -0.511005
C  -1.018488 2.02787 0.566788
C  1.202452 -1.180454 0.838658
C  1.683349 -0.483855 -1.433097
C  2.933953 0.012998 -1.018368
C  2.458305 -0.70714 1.267016
C  3.324662 -0.104101 0.333591
C  -0.245382 2.397044 1.825203
H  -3.017771 1.335287 -0.962394
H  -0.969351 0.53908 -2.010987
H  -2.361544 -0.508882 -2.49029
H  -1.766008 0.273225 1.469118
H  1.405906 -0.422545 -2.489293
H  2.759492 -0.797783 2.313451
H  0.803016 2.608913 1.556013
H  -0.667409 3.324935 2.249956
H  -0.268167 1.608549 2.596661
H  -4.498998 -1.368728 1.451883
