program: Gaussian 09
title: 000127579
version: EM64L-G09RevD.01
frameworkgroup: C1[X(C9H11N3O2)]
method: RPBEPBE
basis: SDD
operation: Freq
keyword: #p
keyword: freq=noraman
keyword: PBEPBE/SDD
title: #p freq=noraman PBEPBE/SDD
converged: YES YES NO NO
title: Mulliken charges:
elementType: O O N N N C C C C C C C C C H H H H H H H H H H H
charge: -0.275365 -0.338883 -0.132635 0.040323 0.039063 -0.203111 -0.462393 -0.457289 -0.388961 0.444449 -0.342351 -0.367818 -0.164829 -0.235683 0.278289 0.248104 0.239709 0.241847 0.243017 0.258233 0.264387 0.300865 0.251842 0.235517 0.283673
chargesum: 0.00000
title: Mulliken charges with hydrogens summed into heavy atoms:
elementType: O O N N N C C C C C C C C C
charge: -0.275365 -0.338883 -0.132635 0.040323 0.039063 0.075178 0.025420 0.027575 0.133659 0.444449 -0.041486 -0.115976 0.070688 0.047989
polarizability: 1.47424831e+02 -3.43666827e+00 1.33721522e+02 2.13678688e+00 1.61192441e+01 9.27695069e+01
1716.lowfreq: -8.6528 -2.8413 -0.0009 -0.0008 -0.0005 8.5286 21.9995 45.0734 79.9218
frequency: 21.4375 45.0250 79.9100 115.8173 198.5657 200.9292 202.8894 224.1701 302.9961 325.7660 378.3033 446.7993 461.0840 508.7449 535.9600 558.6856 574.7686 646.2557 683.0857 738.0072 756.9067 785.7045 824.7854 847.3951 867.1215 871.3345 877.0157 905.5654 948.7627 960.4400 983.4857 996.9024 1047.6560 1076.7964 1086.1723 1115.7575 1140.4430 1150.3470 1168.4739 1184.8361 1191.8408 1225.0515 1245.3696 1259.8422 1284.6029 1291.6049 1297.6907 1310.4459 1324.0330 1327.5745 1348.1147 1419.1617 1465.1730 1472.8038 1483.8516 1485.8861 1543.2601 1614.1294 3001.3724 3014.5070 3023.0764 3035.7510 3063.1354 3089.1724 3100.6874 3148.6745 3170.9987 3208.7979 3215.6589
redmass: 5.1269 7.3193 4.3595 2.8201 4.4640 3.3443 3.8783 6.9037 2.8764 7.3894 5.3918 3.2332 6.0567 5.0015 8.0665 2.7646 3.7697 3.4331 2.1779 3.9905 5.1783 1.5525 2.6729 2.0658 2.0658 1.5563 1.5459 2.0258 2.3531 1.3172 2.0874 6.0688 2.2444 1.7993 1.7086 1.8974 1.7461 1.9411 1.1322 2.4628 2.2364 1.3720 1.7477 2.3673 3.2991 1.6708 1.8472 1.5962 1.7815 1.5100 2.1245 2.1714 1.0984 1.0930 1.4023 1.9258 5.2537 6.1195 1.0620 1.0657 1.0634 1.0840 1.0998 1.1012 1.1049 1.0889 1.0952 1.0928 1.0972
irintensity: 1.2632 2.7339 1.9318 0.5046 4.5035 0.7298 0.7978 4.0888 0.0737 0.6298 4.6322 3.3868 6.9826 2.7539 3.5518 0.4680 2.7787 3.5441 29.6455 9.5157 18.9381 57.9099 0.3386 10.2777 4.5313 0.5189 22.3451 5.0994 2.3016 0.2987 18.2846 22.6232 14.4481 2.8137 6.8294 78.0871 38.8066 19.9273 17.5597 32.6035 59.0048 8.2181 21.5057 48.9792 1.4242 23.5604 32.0903 36.4174 42.6929 5.0845 23.7441 44.9986 12.0373 9.5026 7.3694 8.5880 20.8269 42.5065 14.5882 17.4539 19.8258 16.2430 9.4425 14.0260 47.5868 3.4729 8.7683 0.4533 0.6530
temp: 298.150 k
press: 1.00000 atm
elementType: 8 8 7 7 7 6 6 6 6 6 6 6 6 6 1 1 1 1 1 1 1 1 1 1 1
symmnumber: 1
zpe: 511447.7 jmol-1
zpe.correction: 0.194800 hartree
zpe.thermalcorrener: 0.206907 hartree
zpe.thermalcorrenthalpy: 0.207851 hartree
zpe.thermalcorrgfe: 0.154865 hartree
zpe.sumelectzpe: -663.103520 hartree
zpe.sumelectthermal: -663.091413 hartree
zpe.sumelectthermalent: -663.090469 hartree
zpe.sumelectthermalfe: -663.143455 hartree
dipole: 0.3780 -7.5270 0.8047
dipole: 7.5793
quadrupole: -83.0335 -89.4376 -84.1616
quadrupole: 0.7207 -12.7233 2.9108
quadrupole: 2.5107 -3.8934 1.3826 0.7207 -12.7233 2.9108
hfenergy: -663.2983202 hartree
pointgroup: C01 [X(C9H11N3O2)]
dipole: -0.1098872 -1.8035189 2.3721514 debye
dipolederiv: -0.6491593 -0.5360349 0.3018935 -0.0513848 -0.4150025 0.003571 0.4525062 0.5413666 -0.5023983 -0.4239023 0.0106692 -0.202751 0.0095116 -0.3191119 0.0173819 -0.3116818 0.0292313 -1.0306912 -0.4558275 -0.1737549 0.0899363 -0.5590317 -0.7912932 0.437353 0.0758654 0.1443232 -0.2407082 0.3857322 0.6293851 -0.3559045 0.6687972 0.8311287 -0.4199763 -0.4597734 -0.6189375 0.2543129 0.2286409 -0.0073861 0.2560299 -0.0199739 0.1225727 -0.0275156 0.3792033 -0.0335435 1.0497715 0.5333506 0.0982842 -0.0656125 0.2238924 0.1342989 -0.0064942 -0.2177497 -0.0812806 0.3132867 0.0206505 -0.000422 0.0751166 -0.0557308 0.0519719 -0.0235065 0.0436071 0.0002496 0.0669216 0.0989763 0.0357527 0.0321314 0.0015186 0.0574714 -0.0001284 0.0331675 0.0240236 0.0138873 0.2998861 0.0140572 0.0375112 -0.0970949 0.1367678 0.0325098 0.1009752 0.0171687 0.1561203 0.3112152 -0.0667513 0.0747356 -0.0293902 -0.047785 0.0058991 0.0550567 0.0288953 0.1221753 -0.2237335 0.0352124 -0.356176 0.0392739 -0.1026183 -0.0169945 -0.0746234 0.0016867 -0.1481373 -0.3738404 0.0022821 0.0104671 0.0082083 -0.1817552 0.0033398 -0.0043735 -0.016617 -0.085579 0.1857908 0.0004226 -0.0091548 0.0103265 -0.0810758 -0.0058751 0.0933783 -0.0063035 0.1769075 0.0886986 -0.0020203 0.2457802 0.0038831 -0.1484646 0.0084889 -0.1222201 0.0107616 -0.285158 -0.0166853 -0.0187632 0.0173657 0.0000612 0.0031003 -0.0875497 0.0223293 -0.0395019 -0.0279352 -0.0051188 -0.0872586 0.1051889 -0.1061214 0.0286502 0.0335892 0.0866099 0.0493398 0.0208361 -0.1025007 0.0241351 -0.1385635 0.0345704 0.0429315 -0.0303395 -0.0968256 -0.0204133 -0.0226861 -0.0195508 0.1288744 -0.0071372 0.1007218 -0.0747369 0.0227878 0.0035234 0.0190176 0.0888807 -0.0478665 -0.099236 -0.0680134 -0.0785778 0.0622794 -0.0152109 -0.0736072 -0.0362878 -0.0126707 -0.103684 0.0226847 -0.0256852 -0.048471 0.0097095 0.009448 -0.0526128 -0.0119011 0.0739762 0.0739882 0.00104 -0.0383242 -0.0171111 0.0271366 0.0401456 0.0013226 -0.0294441 -0.0795534 0.0881222 0.0025144 0.0071323 -0.0166202 0.1546619 0.0002903 0.0645704 0.0096239 0.0508248 0.0828615 -0.0032315 -0.072675 -0.009784 0.156761 0.0083904 -0.0520243 0.0085527 -0.0438655 -0.0111266 -0.0064644 0.0910692 -0.0088805 0.1518428 0.006753 0.0984963 0.005707 0.0265303 0.0350826 -0.0039909 -0.0043608 -0.0025931 0.190559 0.003643 -0.0451198 0.0042829 0.0649516 unknown
polarizability: 147.3081642|4.1822049|89.5374911|-1.795424|-10.6722421|137.0702047 unknown
InChI: InChI=1S/C9H11N3O2/c13-10-12-6-2-4-9(12)8-3-1-5-11(14)7-8/h1,3,5,7,9H,2,4,6H2
charge 0 multiplicity 1
25 atoms
O  3.169136 1.843939 -1.313973
O  -2.509754 0.170738 -2.369846
N  1.98159 0.408646 -0.09701
N  2.271308 1.715825 -0.39374
N  -2.1638 0.13332 -1.085312
C  1.057901 0.092466 1.018924
C  1.554713 -1.330472 1.429996
C  2.032074 -1.955421 0.089891
C  2.686092 -0.774382 -0.668532
C  -0.422025 0.106288 0.625095
C  -0.815601 0.160992 -0.717948
C  -1.41196 0.038229 1.641257
C  -2.772049 0.021195 1.260945
C  -3.137581 0.065125 -0.089438
H  1.21203 0.827957 1.828417
H  0.764202 -1.919796 1.921449
H  2.40441 -1.231573 2.130054
H  2.7396 -2.786243 0.244198
H  1.169596 -2.344071 -0.47991
H  3.771008 -0.674146 -0.473385
H  2.554065 -0.81228 -1.763673
H  -0.127619 0.249405 -1.558952
H  -1.127187 0.010282 2.6977
H  -3.56638 -0.022628 2.011728
H  -4.162666 0.056101 -0.461035
