program: Gaussian 09
title: 000127607
version: EM64L-G09RevD.01
frameworkgroup: C1[X(C14H13N5O8)]
method: RPBEPBE
basis: SDD
operation: Freq
keyword: #p
keyword: freq=noraman
keyword: PBEPBE/SDD
title: #p freq=noraman PBEPBE/SDD
converged: YES YES NO NO
title: Mulliken charges:
elementType: O O O O O O O O N N N N N C C C C C C C C C C C C C C H H H H H H H H H H H H H
charge: -0.287692 -0.229871 -0.444063 -0.430586 -0.427659 -0.190986 -0.429483 -0.270378 -0.167424 -0.073933 -0.290511 -0.038712 -0.596517 -0.238908 -0.157684 -0.082888 0.187281 0.294898 -0.363419 -0.210129 0.177593 0.308098 -0.182170 0.126416 -0.117229 0.171867 -0.248611 0.278500 0.305500 0.239680 0.290107 0.279260 0.371581 0.277494 0.370693 0.388011 0.443353 0.266933 0.355743 0.345850
chargesum: 0.00000
title: Mulliken charges with hydrogens summed into heavy atoms:
elementType: O O O O O O O O N N N N N C C C C C C C C C C C C C C
charge: -0.287692 -0.229871 -0.072482 -0.059893 -0.039649 -0.190986 0.013870 -0.270378 -0.167424 -0.073933 -0.290511 -0.038712 0.105076 0.039592 0.147816 0.156792 0.187281 0.294898 -0.073312 0.069130 0.177593 0.308098 0.095323 0.126416 -0.117229 0.171867 0.018321
polarizability: 2.96127874e+02 3.30961822e+00 2.03802392e+02 3.02156868e+00 5.41920402e+00 1.37524922e+02
1716.lowfreq: -8.5446 -4.5104 0.0004 0.0004 0.0007 4.8192 28.2978 35.8815 52.9868
frequency: 28.2750 35.8696 52.9610 61.6890 80.9038 87.1422 106.6797 113.2020 119.0840 146.5927 151.0928 161.2983 195.8953 207.7216 227.7557 239.2258 262.7039 271.0305 278.4500 289.9951 321.0206 337.0799 343.0209 356.3525 376.3108 411.6035 433.9582 444.4381 477.3038 489.5746 521.3461 523.6423 537.6834 557.4198 562.8447 568.6428 574.3572 579.2222 592.9575 622.7208 629.8823 638.5124 649.2376 668.9173 680.3349 700.5124 716.6217 751.6924 761.4602 793.3887 796.9852 811.8280 829.2811 871.6191 877.2448 890.6068 919.4937 932.4582 946.9027 967.2498 978.3743 995.6552 1013.8106 1021.9908 1027.4947 1052.0043 1060.4634 1079.1425 1085.3704 1134.0941 1152.9103 1171.7826 1186.3438 1201.3352 1216.0821 1223.4684 1239.1199 1243.0516 1252.6839 1254.3773 1277.9583 1279.8920 1285.6860 1289.1130 1323.9861 1325.0873 1348.4387 1361.8167 1375.8257 1379.6250 1398.7328 1421.2625 1446.5948 1467.8111 1481.8871 1535.3332 1583.4824 1586.0935 1642.8847 1682.7220 1686.8494 1847.0888 2988.4566 3019.7696 3051.6718 3092.7582 3176.6641 3235.7529 3235.8985 3464.2794 3527.3825 3530.6727 3587.1918 3683.3070
redmass: 7.9809 7.0277 10.6818 8.1626 8.5407 6.7678 8.1294 8.6186 6.5209 7.5737 7.4677 7.2818 7.0254 6.2313 5.8573 5.7047 4.4245 5.3985 5.3101 5.1474 1.4666 6.8321 2.9288 6.9207 6.8420 4.6313 2.6425 1.7916 4.3866 4.6490 3.3892 4.8730 5.4061 2.6275 1.1970 4.1741 2.4580 1.3483 5.1078 4.3689 5.1929 5.5244 4.2276 6.8060 6.4457 6.6944 6.7934 4.3670 5.5705 4.9419 2.6937 2.8592 1.7406 5.2847 7.7279 7.3008 4.3366 1.4356 5.2232 2.8651 3.1145 5.0516 4.8174 7.1063 4.2844 4.6236 3.2082 3.9794 2.5587 2.6041 2.3423 2.1172 1.6781 1.5139 1.7494 1.5848 1.3552 1.9592 1.8428 1.9103 1.6097 1.6583 1.8084 2.3463 2.9231 1.6304 2.9404 1.8931 1.4082 1.6611 2.1055 2.3525 3.1906 1.3536 3.1280 5.3754 7.0633 1.7290 3.1053 10.0940 9.1434 1.2204 1.0839 1.0869 1.0857 1.0856 1.0935 1.0995 1.0987 1.0644 1.0643 1.0448 1.0665 1.1057
irintensity: 0.4227 0.9823 0.9886 2.1941 0.1384 0.0335 6.7391 0.9598 3.5913 4.0993 2.1335 15.9352 1.1854 0.1578 3.0508 38.1333 39.3343 2.1192 13.7973 18.1582 72.3492 5.4523 73.8921 7.2875 9.5656 9.4025 75.1591 47.6786 13.4944 23.7104 37.9398 9.6381 15.4755 59.1191 37.4261 23.7134 64.6170 147.5266 16.6946 74.4499 36.4526 6.1971 66.3808 17.3189 0.6709 18.4629 57.2018 1.8973 39.0462 31.8646 158.0164 30.5413 9.3218 22.8312 40.7480 60.4749 89.0102 12.1583 238.2810 4.9179 8.8784 3.4750 58.0468 38.2096 129.9157 32.2655 104.4545 19.1102 15.5343 36.7950 76.4463 235.0495 17.9979 31.2994 155.8012 16.0539 67.5417 345.5790 33.7236 34.3716 40.4783 49.9955 2.2934 31.3528 107.4624 6.4115 55.6188 130.3364 170.2047 16.8648 44.9619 6.5279 48.1807 35.0462 22.9616 635.7074 265.4072 19.3727 876.7722 215.1064 78.0236 2999.3539 19.6422 8.4785 14.7843 5.1901 2.4459 1.0875 6.5187 29.2134 36.7304 174.4869 31.0122 60.1609
temp: 298.150 k
press: 1.00000 atm
elementType: 8 8 8 8 8 8 8 8 7 7 7 7 7 6 6 6 6 6 6 6 6 6 6 6 6 6 6 1 1 1 1 1 1 1 1 1 1 1 1 1
symmnumber: 1
zpe: 734476.2 jmol-1
zpe.correction: 0.279747 hartree
zpe.thermalcorrener: 0.302806 hartree
zpe.thermalcorrenthalpy: 0.303750 hartree
zpe.thermalcorrgfe: 0.227630 hartree
zpe.sumelectzpe: -1414.846501 hartree
zpe.sumelectthermal: -1414.823442 hartree
zpe.sumelectthermalent: -1414.822498 hartree
zpe.sumelectthermalfe: -1414.898618 hartree
dipole: 7.0998 1.9806 -1.7400
dipole: 7.5734
quadrupole: -134.5948 -157.6602 -154.8888
quadrupole: -2.1966 10.2000 5.4393
quadrupole: 14.4532 -8.6123 -5.8409 -2.1966 10.2000 5.4393
hfenergy: -1415.126248 hartree
pointgroup: C01 [X(C14H13N5O8)]
dipole: -2.8323235 0.706002 0.5979998 debye
polarizability: 295.6547054|-2.0373499|204.0867634|9.7976513|-2.3097251|137.7137193 unknown
InChI: InChI=1S/C14H13N5O8/c15-9-5-10(17-2-16-9)19(3-18-5)11-6(20)7-4(26-11)1-14(27-7,13(24)25)8(21)12(22)23/h1-3,6-8,11,20-22,24H,15H2
charge 0 multiplicity 1
40 atoms
O  2.723197 0.739854 -0.736944
O  -0.01119 1.541252 1.453101
O  -0.013177 2.415536 -2.085223
O  3.964096 -1.872035 -1.109434
O  5.031582 -0.745269 1.725425
O  5.271518 1.144324 0.387572
O  0.641229 -1.880322 0.397543
O  1.319189 -1.841978 -1.830499
N  -2.031871 1.312088 0.132992
N  -4.332806 1.37524 0.102587
N  -1.76645 -1.202731 -0.015862
N  -3.915686 -2.36126 -0.15916
N  -5.969687 -1.201795 -0.112771
C  1.636838 1.618806 -0.309403
C  0.255816 1.478663 -1.006349
C  -0.701645 1.894801 0.156388
C  3.116993 -0.123343 0.42383
C  1.292755 1.152367 1.081554
C  2.141824 0.214634 1.549732
C  2.996166 -1.623333 -0.064592
C  4.581121 0.192742 0.786475
C  -2.459154 -0.023898 0.042359
C  -3.210229 2.095675 0.173005
C  1.562501 -1.827633 -0.588486
C  -3.879049 0.047342 0.019645
C  -4.609527 -1.17215 -0.084367
C  -2.56413 -2.316414 -0.119403
H  1.970008 2.674234 -0.373795
H  0.101672 0.428341 -1.319982
H  -0.830467 2.991307 0.124985
H  2.068517 -0.377906 2.458749
H  3.221267 -2.297179 0.776065
H  0.471512 2.128178 -2.898634
H  -3.161069 3.180595 0.239929
H  3.513165 -1.654519 -1.972512
H  5.977022 -0.548367 1.963496
H  -0.392913 -1.570018 0.145098
H  -2.035297 -3.271886 -0.174304
H  -6.498409 -0.332545 -0.05818
H  -6.44483 -2.099695 -0.190331
