program: Gaussian 09
title: 000127577
version: EM64L-G09RevD.01
frameworkgroup: C1[X(C13H18O3S)]
method: RPBEPBE
basis: SDD
operation: Freq
keyword: #p
keyword: freq=noraman
keyword: PBEPBE/SDD
title: #p freq=noraman PBEPBE/SDD
converged: NO YES NO NO
title: Mulliken charges:
elementType: S O O O C C C C C C C C C C C C C H H H H H H H H H H H H H H H H H H
charge: 0.203913 -0.258635 -0.432367 -0.450938 -0.416137 -0.318250 0.345152 -0.615921 0.234312 0.339452 -0.342685 0.239291 -0.073793 -0.845250 -0.338935 -0.816471 -0.901556 0.268645 0.214117 0.230233 0.238442 0.210215 0.271725 0.225590 0.230868 0.186170 0.191769 0.240453 0.261479 0.226042 0.271087 0.230505 0.240500 0.368391 0.342586
chargesum: 0.00000
title: Mulliken charges with hydrogens summed into heavy atoms:
elementType: S O O O C C C C C C C C C C C C C
charge: 0.203913 -0.258635 -0.063976 -0.108352 -0.147491 0.126100 0.345152 -0.615921 0.234312 0.339452 0.105972 0.239291 -0.073793 -0.117067 0.039004 -0.088497 -0.159463
polarizability: 2.12057669e+02 8.64970920e+00 1.86930299e+02 2.08045070e+01 -3.13272053e+00 1.13402495e+02
1716.lowfreq: 0.0011 0.0012 0.0013 1.9525 7.7087 12.5469 23.6197 35.1534 46.8053
frequency: 23.5364 35.0776 46.7940 63.1835 88.7393 107.4677 110.5401 127.3017 142.2623 152.4899 159.2136 187.1559 201.3267 240.0709 268.8352 273.2654 278.1143 289.2767 315.1807 333.7977 336.1602 374.2251 388.6747 415.6161 443.3400 468.0281 498.5705 540.0650 565.1243 567.8075 625.8407 639.9511 718.8140 747.3567 757.1486 785.7417 842.6000 855.9151 911.3121 940.1963 971.4376 1010.0169 1015.2828 1025.2401 1032.7876 1040.2899 1044.4502 1048.0667 1065.4526 1070.2524 1085.6375 1116.7356 1163.8472 1189.5440 1193.8734 1219.7006 1237.0796 1267.2773 1281.1111 1284.9283 1314.5331 1338.4543 1357.5082 1377.9591 1392.0510 1397.7196 1401.7253 1405.0598 1417.6512 1453.5783 1454.5240 1465.0350 1467.4316 1472.9907 1476.2619 1480.9602 1488.5564 1496.9791 1499.1058 1591.7382 1623.1144 2926.8924 2945.6578 2974.4032 2976.7230 2977.0859 2985.4269 3002.1200 3009.1193 3038.5142 3049.4125 3052.3636 3074.4767 3085.3274 3103.4763 3107.0980 3107.6278 3565.9436 3588.2974
redmass: 3.5572 1.1721 4.6063 1.9968 3.1398 1.5150 2.3714 2.6950 2.2534 1.5248 1.8558 3.4506 4.9369 1.2467 2.9567 5.2435 1.1642 3.0759 2.9998 3.8108 3.3937 6.1652 6.9118 7.1921 4.8942 4.6246 4.8582 4.4150 4.4114 5.4335 6.9925 3.3817 4.4919 4.5699 3.0515 1.3920 2.1154 3.2232 1.8357 2.6826 7.3555 2.5630 2.0877 1.4047 1.7186 1.5224 3.2191 1.5788 2.3271 2.0789 2.6485 2.0569 1.2198 1.2293 1.9683 1.3986 2.4679 1.2642 1.3641 1.0894 1.8128 2.2618 1.4848 7.3525 1.4174 1.3177 1.5123 1.8075 1.4310 1.1247 1.3238 1.3559 1.1360 1.0756 1.0557 1.1439 1.0884 1.0451 1.6687 7.0044 8.1488 1.0546 1.0425 1.1059 1.0393 1.0391 1.0602 1.0619 1.0976 1.0990 1.0978 1.0964 1.1010 1.0914 1.0931 1.0947 1.0973 1.0664 1.0652
irintensity: 0.2759 0.4495 0.4352 11.2847 0.8357 0.0690 2.2979 0.3616 3.3468 0.7574 1.1385 0.5015 0.5850 108.0502 15.1530 4.6874 128.3067 18.3014 2.7021 7.6429 11.9624 1.6166 1.7387 3.2915 12.6579 18.6390 3.3076 8.6488 0.2097 1.4555 3.3663 7.0449 32.2644 0.9181 34.6890 0.9491 21.4272 4.8273 34.4393 11.9548 55.2922 46.2585 3.3501 4.7751 72.2456 9.0767 69.0169 1.2041 31.0317 38.3504 54.9896 9.1966 0.7693 7.4204 143.8178 6.2982 12.1038 0.4284 19.4222 1.1033 88.5890 12.7651 1.7857 91.5046 12.9018 23.9302 16.8261 9.1765 8.8622 10.6995 2.0283 5.3448 15.4879 3.2073 24.7712 38.2289 9.9826 0.1948 25.9130 9.6671 5.1439 65.1255 48.9326 48.3970 42.4869 19.8453 10.2124 31.2321 22.7903 2.4838 20.2211 19.5121 25.2119 45.2468 10.0140 8.7044 5.6405 2.0013 32.7850
temp: 298.150 k
press: 1.00000 atm
elementType: 16 8 8 8 6 6 6 6 6 6 6 6 6 6 6 6 6 1 1 1 1 1 1 1 1 1 1 1 1 1 1 1 1 1 1
symmnumber: 1
zpe: 742713.7 jmol-1
zpe.correction: 0.282885 hartree
zpe.thermalcorrener: 0.302288 hartree
zpe.thermalcorrenthalpy: 0.303232 hartree
zpe.thermalcorrgfe: 0.234110 hartree
zpe.sumelectzpe: -1128.602243 hartree
zpe.sumelectthermal: -1128.582840 hartree
zpe.sumelectthermalent: -1128.581896 hartree
zpe.sumelectthermalfe: -1128.651018 hartree
dipole: -0.1486 1.5945 2.4128
dipole: 2.8959
quadrupole: -99.3335 -105.4144 -107.8356
quadrupole: 14.2824 -8.1330 3.0324
quadrupole: 4.8610 -1.2199 -3.6411 14.2824 -8.1330 3.0324
hfenergy: -1128.885128 hartree
pointgroup: C01 [X(C13H18O3S1)]
dipole: -0.0553392 0.4925465 1.0258548 debye
polarizability: 212.0572361|5.3590484|186.2576474|22.2141422|6.6573232|114.0755789 unknown
InChI: InChI=1S/C13H18O3S/c1-7-8(2)12-13(9(3)11(7)15)17-10(16-12)5-4-6-14/h10,14-15H,4-6H2,1-3H3
charge 0 multiplicity 1
35 atoms
S  -0.377994 -2.37953 -1.057529
O  -0.982408 0.277224 -1.372623
O  4.065891 -0.343316 0.970996
O  -5.67256 1.147426 0.896322
C  -1.715375 -0.989368 -1.218144
C  -2.632193 -0.966085 0.009474
C  0.28497 0.217061 -0.730236
C  0.783498 -1.08228 -0.48975
C  1.014162 1.378585 -0.415291
C  2.049925 -1.295148 0.082438
C  -3.751148 0.09465 -0.110818
C  2.306704 1.195823 0.163741
C  2.788806 -0.12158 0.40056
C  0.422851 2.747318 -0.70273
C  -4.641249 0.123159 1.134346
C  2.606236 -2.678963 0.335607
C  3.188543 2.377443 0.535994
H  -2.262415 -1.152895 -2.160478
H  -3.075258 -1.976014 0.122449
H  -2.012946 -0.783311 0.909327
H  -3.307479 1.095558 -0.259683
H  -4.386913 -0.116503 -0.992669
H  -0.586941 2.646115 -1.129382
H  0.345608 3.36074 0.214834
H  1.039377 3.312901 -1.426691
H  -5.105709 -0.875022 1.295974
H  -4.032902 0.37411 2.03109
H  3.070398 -3.096392 -0.579013
H  3.383083 -2.651465 1.115421
H  1.804947 -3.37385 0.646935
H  2.69558 3.336268 0.316737
H  3.435573 2.390927 1.618439
H  4.143489 2.374682 -0.029021
H  4.491177 0.515971 1.212743
H  -6.272228 1.201262 1.682534
