program: Gaussian 09
title: 000127692
version: EM64L-G09RevD.01
frameworkgroup: C1[X(C10H18N3O13P3)]
method: RPBEPBE
basis: SDD
operation: Freq
keyword: #p
keyword: freq=noraman
keyword: PBEPBE/SDD
title: #p freq=noraman PBEPBE/SDD
converged: NO YES NO NO
title: Mulliken charges:
elementType: P P P O O O O O O O O O O O O O N N N C C C C C C C C C C H H H H H H H H H H H H H H H H H H
charge: 1.455052 1.470380 1.419988 -0.300274 -0.442960 -0.518265 -0.239555 -0.741655 -0.617171 -0.647542 -0.716057 -0.764544 -0.514906 -0.642972 -0.643425 -0.642033 -0.185856 -0.066735 -0.367891 -0.121404 -0.080761 -0.519648 -0.012964 -0.326564 -0.041287 0.049457 -0.568040 0.249165 -0.622415 0.246277 0.261737 0.305401 0.290424 0.292189 0.310095 0.256019 0.343579 0.285745 0.299796 0.315511 0.412764 0.232721 0.228280 0.303113 0.453120 0.419093 0.445017
chargesum: 0.00000
title: Mulliken charges with hydrogens summed into heavy atoms:
elementType: P P P O O O O O O O O O O O O O N N N C C C C C C C C C C
charge: 1.455052 1.470380 1.419988 -0.300274 -0.099381 -0.518265 -0.239555 -0.741655 -0.204408 -0.647542 -0.716057 -0.311424 -0.514906 -0.223879 -0.198408 -0.642033 -0.185856 -0.066735 -0.052380 0.124874 0.180976 0.076178 0.279225 0.239550 0.244458 0.049457 -0.268244 0.249165 0.141699
polarizability: 3.03577399e+02 1.98161233e+01 2.86570733e+02 -1.09128750e+01 1.38349151e+01 1.77913489e+02
1716.lowfreq: -8.4350 0.0004 0.0010 0.0012 4.0733 4.4823 18.8184 25.8740 36.0208
frequency: 18.6489 25.7480 36.0150 43.0110 51.1652 53.0750 66.8308 79.2270 87.2427 91.9749 95.9811 110.5078 118.5779 127.9422 137.7332 153.3544 159.3409 173.8674 182.7037 187.1281 197.3872 209.9704 212.9221 217.9485 227.2408 231.3834 253.3291 268.5141 274.0423 282.9341 294.9002 303.9359 310.7122 313.8122 337.2849 342.7351 358.4255 370.0343 378.1150 388.3268 416.7401 419.9824 428.3867 437.0973 474.1324 505.1119 514.3157 530.4203 544.9058 548.6240 559.1542 600.0460 616.9213 636.9818 653.7534 689.6962 694.1549 702.6922 712.1846 718.3060 734.5803 745.4118 750.5776 758.2070 778.9648 782.3141 817.2941 836.3776 850.3210 853.9941 869.6249 896.4463 899.6435 905.7065 929.1817 965.0400 977.3172 981.0079 1028.2360 1035.8590 1042.0721 1047.3125 1059.8138 1070.7304 1077.9206 1094.7236 1101.9663 1115.2715 1123.7616 1130.3951 1155.0149 1165.0773 1189.9871 1199.9483 1209.7777 1218.2674 1241.4799 1253.2045 1279.0037 1282.2290 1305.7467 1312.2404 1316.2733 1322.6888 1357.3735 1378.7567 1402.6919 1414.8237 1448.0693 1460.6779 1471.0567 1484.5493 1486.7451 1490.8141 1551.1459 1609.3028 1640.9384 2772.6928 2826.1821 2983.3012 3006.6939 3013.5276 3046.6712 3054.4956 3064.5246 3072.6857 3103.6132 3121.3631 3136.3428 3143.4054 3176.7382 3384.9514 3561.2540 3565.8850 3573.5883
redmass: 8.0995 8.2677 5.7562 6.4793 9.6401 8.6812 7.3638 7.5551 4.8792 1.1231 8.8235 5.2515 5.3960 7.0670 5.4628 7.6381 5.0198 6.4734 5.7421 7.2779 5.2737 6.3549 4.6941 5.6422 8.2720 5.9742 3.4837 5.1933 6.6548 4.5551 1.4646 2.4397 5.6928 5.2707 10.0791 6.8523 5.7834 7.6228 8.2376 7.3561 7.6535 3.4230 4.2265 8.5861 3.7198 3.8779 5.8381 8.0727 1.1423 3.6376 8.5277 1.5140 4.0450 3.1018 1.8005 10.2528 13.4663 12.0163 6.0663 4.5953 6.0799 8.7473 13.0297 6.0125 9.6428 3.9679 5.0102 2.8291 1.3010 1.2203 3.2480 4.2591 3.7480 6.1771 2.6774 1.3055 2.5023 5.9742 4.0056 2.3534 4.1429 1.7426 3.3037 2.3727 1.9087 5.1127 2.3946 2.3999 1.2848 1.4291 1.3060 1.6436 1.3548 1.2349 2.6340 1.1927 1.2479 1.3246 1.4915 1.8163 1.3435 1.1328 1.5284 1.4541 1.3420 1.4298 1.2345 1.2326 1.8984 1.0876 1.3446 1.0768 3.2746 1.0493 2.3068 6.7888 10.3186 1.0731 1.0771 1.0350 1.0604 1.0854 1.0664 1.0870 1.1025 1.0869 1.1095 1.0987 1.1016 1.0899 1.0958 1.0652 1.0663 1.0775 1.0664
irintensity: 1.3490 0.8746 0.5609 5.8969 0.7811 0.5629 3.4481 2.5758 2.6057 0.4808 1.2922 0.2814 4.1993 13.0288 11.1845 3.5589 1.4152 0.5569 3.3328 8.2896 15.1207 12.7112 5.9769 0.0667 7.5410 8.3081 2.4730 13.5348 10.5165 32.4958 119.7533 18.6307 74.1010 50.3849 27.3366 13.2251 80.7335 89.4644 23.4777 48.5512 52.3686 11.7180 5.5965 35.5952 4.5537 2.2878 19.0248 54.5036 68.5152 11.2645 5.5209 107.1464 57.8487 45.4968 57.4404 43.2207 287.3070 49.4947 15.7433 107.4867 94.4199 158.5868 69.4352 223.5111 167.9868 16.5202 211.1632 11.0533 13.0403 379.5644 2.7114 210.8337 219.2809 42.3160 34.4804 23.6280 106.6458 128.2314 84.5632 22.3103 84.8145 217.0670 24.3059 33.0572 26.5880 274.8959 14.2286 14.5375 0.0089 103.6376 69.0971 39.1930 5.6361 35.7109 99.3533 6.6306 9.7015 83.8686 20.4154 14.1674 5.7057 169.7853 16.6537 61.4937 3.3264 5.6229 0.8677 43.6773 18.3669 12.5305 66.1057 10.8512 53.3107 17.2745 208.8762 338.0239 701.8574 664.0991 2067.6513 80.4234 42.4839 37.5689 0.6884 27.0863 30.6071 4.9154 11.2591 0.0791 0.4161 0.5702 3.0380 145.1631 8.3558 62.8702 127.5303
temp: 298.150 k
press: 1.00000 atm
elementType: 15 15 15 8 8 8 8 8 8 8 8 8 8 8 8 8 7 7 7 6 6 6 6 6 6 6 6 6 6 1 1 1 1 1 1 1 1 1 1 1 1 1 1 1 1 1 1
symmnumber: 1
zpe: 841534.1 jmol-1
zpe.correction: 0.320523 hartree
zpe.thermalcorrener: 0.352488 hartree
zpe.thermalcorrenthalpy: 0.353433 hartree
zpe.thermalcorrgfe: 0.256734 hartree
zpe.sumelectzpe: -2555.448424 hartree
zpe.sumelectthermal: -2555.416459 hartree
zpe.sumelectthermalent: -2555.415515 hartree
zpe.sumelectthermalfe: -2555.512213 hartree
dipole: 2.6020 -0.2106 -3.0116
dipole: 3.9855
quadrupole: -182.9249 -201.4291 -200.2251
quadrupole: 41.5835 22.0406 -2.6582
quadrupole: 11.9348 -6.5694 -5.3654 41.5835 22.0406 -2.6582
hfenergy: -2555.7689471 hartree
pointgroup: C01 [X(C10H18N3O13P3)]
dipole: -1.0059875 -0.0376826 1.20219 debye
polarizability: 304.4350359|-20.1784344|283.2816963|-10.8453344|-20.4757205|180.3448892 unknown
InChI: InChI=1S/C10H18N3O13P3/c1-11-8-2-3-13(10(15)12-8)9-4-6(14)7(24-9)5-23-28(19,20)26-29(21,22)25-27(16,17)18/h2-3,6-7,9,11,14,16-17,19,21H,4-5H2,1H3
charge 0 multiplicity 1
47 atoms
P  -4.016111 0.560846 0.162207
P  -3.182312 -2.426197 0.702084
P  -0.380353 -2.310024 -0.56687
O  0.65659 2.50335 1.214974
O  -0.085034 4.505899 -1.092305
O  -2.90679 1.814453 0.383081
O  3.947531 1.80776 -1.211213
O  -3.396183 -0.724659 1.151171
O  -5.346167 1.25042 0.956591
O  -4.357094 -0.023892 -1.29424
O  -1.483223 -2.617295 0.809102
O  -3.346973 -2.411699 -1.010436
O  -4.050628 -3.402077 1.570865
O  1.061618 -2.933514 0.005283
O  -0.843262 -3.465053 -1.710663
O  -0.414206 -0.771336 -0.966128
N  2.419364 1.064496 0.405294
N  4.39726 -0.247318 -0.158457
N  4.774367 -2.297201 0.906162
C  -0.40844 3.088078 -0.887102
C  -0.67657 2.782541 0.607365
C  0.869764 2.289913 -1.193022
C  1.6507 2.323003 0.141914
C  -1.50208 1.513757 0.851391
C  2.028893 0.127372 1.310138
C  3.660371 0.895966 -0.390049
C  2.74052 -1.064911 1.4732
C  3.987997 -1.186696 0.721049
C  6.035972 -2.529442 0.190157
H  -1.264574 2.778482 -1.516996
H  -1.106691 3.646804 1.14181
H  1.445234 2.755355 -2.004705
H  0.622848 1.250688 -1.467627
H  2.374212 3.153354 0.173899
H  -1.094412 0.661386 0.280893
H  -1.551396 1.282146 1.928018
H  -0.89643 5.057455 -0.954285
H  1.140791 0.367862 1.900539
H  2.516055 -1.712972 2.326675
H  4.446178 -3.00931 1.559408
H  -6.229221 0.885901 0.685756
H  5.978933 -3.450615 -0.418225
H  6.880895 -2.615219 0.897762
H  6.203117 -1.666938 -0.472261
H  -3.833877 -1.57453 -1.384306
H  1.664832 -2.23385 0.463743
H  -1.819717 -3.375137 -1.930139
