program: Gaussian 09
title: 000127628
version: EM64L-G09RevD.01
frameworkgroup: C1[X(C28H19NO5)]
method: RPBEPBE
basis: SDD
operation: Freq
keyword: #p
keyword: freq=noraman
keyword: PBEPBE/SDD
title: #p freq=noraman PBEPBE/SDD
converged: YES YES NO NO
title: Mulliken charges:
elementType: O O O O O N C C C C C C C C C C C C C C C C C C C C C C C C C C C C H H H H H H H H H H H H H H H H H H H
charge: -0.273611 -0.170316 -0.219939 -0.197180 -0.195368 0.026246 -0.425175 0.303834 0.300156 0.169822 0.176582 -0.516601 -0.427844 -0.424841 -0.399345 -0.396833 0.253342 -0.254550 -0.239616 -0.242425 -0.231566 0.280470 0.280877 -0.330138 0.358105 -0.510277 -0.370867 0.007868 0.294085 -0.357584 -0.354981 -0.235350 -0.230529 -0.225783 0.265576 0.243858 0.253692 0.242107 0.238551 0.243226 0.240357 0.230991 0.227846 0.230321 0.227384 0.280742 0.321658 0.283761 0.267271 0.272544 0.237458 0.235553 0.236438
chargesum: 0.00000
title: Mulliken charges with hydrogens summed into heavy atoms:
elementType: O O O O O N C C C C C C C C C C C C C C C C C C C C C C C C C C C C
charge: -0.273611 -0.170316 -0.219939 -0.197180 -0.195368 0.026246 -0.159600 0.303834 0.300156 0.169822 0.176582 -0.019051 -0.185737 -0.186290 -0.156119 -0.156476 0.253342 -0.023559 -0.011770 -0.012104 -0.004183 0.280470 0.280877 -0.049396 0.358105 -0.188619 -0.087105 0.007868 0.294085 -0.090312 -0.082437 0.002108 0.005024 0.010655
polarizability: 3.68636009e+02 1.96721164e+01 3.59733121e+02 1.54464268e+01 -1.86864593e+01 2.64965487e+02
1716.lowfreq: -3.7336 -1.6633 -0.0003 -0.0002 0.0007 4.2391 7.0571 12.3652 15.9255
frequency: 7.0005 12.2751 15.8567 28.3207 40.9253 43.4660 47.7691 53.8133 78.8774 85.2487 108.7791 118.0698 130.2385 138.1009 152.2391 168.7285 182.6189 207.4353 209.7269 245.3064 266.6929 289.9588 305.9407 341.9945 344.7323 363.9274 388.7065 403.0726 409.4383 411.5840 427.9144 438.2501 442.5012 445.9587 495.3327 506.9293 508.9660 518.9445 542.5753 559.4044 571.9240 606.0691 613.7679 617.9379 625.3110 628.3942 660.9744 667.6324 693.8012 701.3342 711.4197 718.6357 727.6551 732.5392 745.6764 751.7070 757.5702 767.4842 788.9048 794.5683 795.8289 806.4701 842.9388 861.6121 872.9785 874.8755 881.2306 895.6236 934.8175 949.8372 951.6201 951.8066 956.7248 958.5901 986.8639 988.8153 989.0315 991.3441 995.2930 996.7481 996.8774 1007.3687 1022.3044 1027.0629 1029.5334 1061.0525 1067.3657 1086.3739 1103.1917 1112.2327 1136.7099 1160.6779 1165.7015 1171.3526 1175.9493 1176.0671 1180.2552 1185.2086 1190.4417 1203.5360 1207.8178 1215.8701 1243.3812 1247.0248 1258.6714 1290.4315 1303.4285 1304.4873 1319.7088 1338.2887 1355.7144 1378.0918 1379.0544 1384.8058 1403.1952 1415.6163 1434.3690 1439.7142 1445.1633 1456.2534 1469.6580 1474.8507 1481.7875 1483.7757 1533.4663 1568.8470 1587.4298 1591.3411 1593.6970 1606.7550 1609.7352 1619.2333 1621.9714 1691.3940 2969.0951 3033.9953 3100.2284 3123.1715 3124.1393 3129.8969 3131.4139 3131.9861 3140.8395 3143.4399 3144.7318 3151.0375 3157.8411 3160.9774 3161.9635 3163.4361 3171.4941 3174.7112 3178.2909
redmass: 6.6286 6.4437 5.9414 8.2900 5.8312 9.5815 7.1731 5.2390 6.4170 5.0330 8.3322 5.5155 7.0857 5.2155 5.0848 5.9076 6.2172 4.4443 6.6913 4.8578 9.3874 4.5497 5.6035 5.5972 6.3330 6.9728 4.6796 3.0030 5.5861 4.2273 3.5863 4.2895 4.2319 3.0366 5.3249 5.3890 4.6325 6.5211 4.1503 4.1506 3.6584 4.6663 6.4296 6.9190 6.5844 5.8047 6.5955 7.0087 4.2487 2.5525 5.0550 5.2770 2.9188 4.2345 1.7139 1.7232 2.7549 5.0885 2.7420 2.7570 2.9310 3.5288 3.7313 1.2508 1.7152 1.8526 1.4880 2.7377 2.4629 1.5715 1.9732 1.5604 1.4269 2.5113 1.3383 1.3323 5.7022 1.4158 2.0738 3.3947 2.3486 1.3401 2.2109 2.1450 2.0792 3.0995 2.6307 1.5846 1.9271 1.6961 1.6177 2.4425 1.3228 1.1015 1.0894 1.2707 1.3412 1.7639 1.1710 2.8916 2.2320 5.6390 1.6710 1.5937 1.5149 3.2390 1.7975 1.6469 1.3753 1.4528 4.9844 7.9342 8.3826 8.5497 3.8223 6.3471 2.2803 2.2321 2.6935 1.1094 2.6548 2.4169 2.7533 4.0105 10.2392 7.9353 6.5314 6.6386 6.9215 6.3602 6.5766 7.3495 7.1090 11.3679 1.0820 1.0591 1.1045 1.0854 1.0855 1.0895 1.0896 1.0853 1.0881 1.0946 1.0946 1.0926 1.0890 1.0964 1.1002 1.1003 1.1014 1.0962 1.0931
irintensity: 0.0744 0.4516 0.0919 0.7339 0.5774 2.3909 1.1831 0.7760 0.0102 1.9372 2.9140 0.7559 2.1079 0.8348 1.2881 5.2312 0.9905 0.3667 0.9460 0.3814 0.3433 0.3223 6.4764 2.3077 0.3030 0.2835 1.7762 0.3037 0.5708 8.0073 8.4435 3.1406 0.4069 0.2303 8.1112 1.6332 0.8620 1.8117 9.6736 0.6325 0.1302 31.1901 0.3414 5.6289 22.4107 14.5863 23.9932 22.2033 12.0786 32.1517 4.2338 0.2134 30.5144 50.7714 0.4263 135.9776 44.2783 4.5212 0.3570 9.6424 11.0387 14.6386 34.2696 4.3811 41.3380 3.2499 1.0951 47.3748 43.1727 14.5830 8.7463 50.0619 6.0445 44.2570 0.3879 0.0578 5.2105 6.6753 19.3892 0.3917 7.9555 1.3054 5.3218 2.7904 35.3494 389.0394 63.5742 9.9880 14.5354 13.1917 24.7924 12.8848 13.5632 0.9510 6.3449 54.3767 8.0025 55.9514 40.9723 55.8736 16.3794 189.5086 17.5540 76.7507 45.2747 284.1267 0.3813 1.3041 21.0628 26.7355 35.8635 63.1095 6.5425 2.3535 0.5986 44.1800 22.8292 26.6602 9.7196 23.4995 8.7895 30.8039 14.7300 1.1311 101.1030 57.9024 22.8937 0.9567 0.3116 92.6966 17.2810 4.1773 0.5308 110.2034 11.3381 11.8284 5.3783 2.8158 3.6932 3.9271 3.2337 0.6197 3.2297 4.6420 44.3117 17.9076 0.3576 17.2944 41.8840 21.2419 21.6887 0.4224 2.9191
temp: 298.150 k
press: 1.00000 atm
elementType: 8 8 8 8 8 7 6 6 6 6 6 6 6 6 6 6 6 6 6 6 6 6 6 6 6 6 6 6 6 6 6 6 6 6 1 1 1 1 1 1 1 1 1 1 1 1 1 1 1 1 1 1 1
symmnumber: 1
zpe: 1036928.8 jmol-1
zpe.correction: 0.394945 hartree
zpe.thermalcorrener: 0.422589 hartree
zpe.thermalcorrenthalpy: 0.423533 hartree
zpe.thermalcorrgfe: 0.331578 hartree
zpe.sumelectzpe: -1506.861235 hartree
zpe.sumelectthermal: -1506.833592 hartree
zpe.sumelectthermalent: -1506.832648 hartree
zpe.sumelectthermalfe: -1506.924603 hartree
dipole: -1.1909 1.1036 1.5685
dipole: 2.2575
quadrupole: -168.8387 -197.8617 -188.7187
quadrupole: -5.4261 8.6804 -9.0832
quadrupole: 16.3010 -12.7220 -3.5790 -5.4261 8.6804 -9.0832
hfenergy: -1507.2561808 hartree
pointgroup: C01 [X(C28H19N1O5)]
dipole: -0.4585239 0.5148276 -0.5599591 debye
polarizability: 368.8887008|8.4861922|277.5415243|-21.8042296|38.1507709|346.9043918 unknown
InChI: InChI=1S/C28H19NO5/c30-27(17-24-22-12-6-4-10-20(22)21-11-5-7-13-23(21)24)34-26-15-14-19(16-25(26)29(32)33)28(31)18-8-2-1-3-9-18/h1-16,24H,17H2
charge 0 multiplicity 1
53 atoms
O  -1.032587 -1.35849 0.440789
O  -1.167051 0.37438 2.020997
O  4.420061 -0.342609 -2.748509
O  2.353302 -1.232168 3.099335
O  0.283062 -2.108394 2.751132
N  1.335597 -1.481887 2.345417
C  -4.16672 -0.557586 0.799878
C  -3.930566 -0.709636 -0.705906
C  -4.338761 0.956473 0.955423
C  -3.975726 0.567372 -1.341326
C  -4.234422 1.596751 -0.315242
C  -3.064291 -1.192347 1.716474
C  -3.706053 -1.875255 -1.457016
C  -4.582371 1.707734 2.116949
C  -3.78769 0.679733 -2.736751
C  -4.38278 2.996261 -0.42736
C  -1.689808 -0.610507 1.482306
C  -3.516367 -1.763644 -2.857761
C  -4.728763 3.113179 2.005638
C  -3.556077 -0.495194 -3.490401
C  -4.631554 3.749872 0.743264
C  0.280752 -1.032216 0.061915
C  1.410403 -1.052622 0.927374
C  0.466763 -0.710926 -1.302217
C  2.869214 -0.373501 -0.923767
C  2.689233 -0.708501 0.435435
C  1.744029 -0.403282 -1.79407
C  4.221241 -0.076118 -1.521226
C  5.313475 0.521274 -0.685868
C  5.056962 1.358831 0.434732
C  6.658236 0.289865 -1.086702
C  6.128326 1.940851 1.146039
C  7.725382 0.859381 -0.366316
C  7.462834 1.68572 0.754126
H  -5.111184 -1.068967 1.081284
H  -3.327555 -1.008595 2.772025
H  -3.026482 -2.280781 1.544101
H  -3.662868 -2.858609 -0.975272
H  -4.651581 1.226776 3.099437
H  -3.82252 1.655993 -3.233123
H  -4.307507 3.495687 -1.39983
H  -3.339434 -2.663675 -3.456952
H  -4.914565 3.71368 2.902834
H  -3.411261 -0.426991 -4.574525
H  -4.746965 4.837455 0.676417
H  -0.415739 -0.705687 -1.949388
H  3.531227 -0.75012 1.131139
H  1.899426 -0.177386 -2.853507
H  4.027469 1.585188 0.730842
H  6.838228 -0.335915 -1.96703
H  5.922248 2.592873 2.001411
H  8.758506 0.665478 -0.673976
H  8.292671 2.1321 1.313228
