program: Gaussian 09
title: 000127528
version: EM64L-G09RevD.01
frameworkgroup: C1[X(C15H16N8)]
method: RPBEPBE
basis: SDD
operation: Freq
keyword: #pfreq=noraman
keyword: PBEPBE/SDD
title: #p freq=noraman PBEPBE/SDD
converged: YES YES NO YES
title: Mulliken charges:
elementType: N N N N N N N N C C C C C C C C C C C C C C C H H H H H H H H H H H H H H H H
charge: -0.118751 -0.118771 -0.142623 -0.142637 -0.631876 -0.631524 -0.631883 -0.631512 0.253165 0.253042 -0.580746 -0.103026 -0.103077 0.417030 0.417028 -0.629904 -0.629945 -0.439756 -0.439725 -0.245137 -0.245173 0.270300 0.270306 0.264089 0.264088 0.257942 0.257950 0.237724 0.237729 0.223069 0.223083 0.336573 0.309524 0.300832 0.362834 0.336573 0.309525 0.300834 0.362828
chargesum: 0.00000
title: Mulliken charges with hydrogens summed into heavy atoms:
elementType: N N N N N N N N C C C C C C C C C C C C C C C
charge: -0.118751 -0.118771 -0.142623 -0.142637 0.014220 0.032142 0.014215 0.032150 0.253165 0.253042 -0.052569 -0.103026 -0.103077 0.417030 0.417028 -0.371962 -0.371995 -0.202032 -0.201996 -0.022068 -0.022090 0.270300 0.270306
polarizability: 4.63273430e+02 1.77336411e-02 3.82699051e+02 -4.47271013e-03 8.89662026e-03 8.98279486e+01
1716.lowfreq: -128.0062 -126.4318 -2.3199 -0.0010 -0.0004 0.0009 2.0759 2.4991 36.8420
frequency: -128.0062 -126.4312 36.8411 49.7089 49.8894 56.6846 67.0370 69.7167 120.7457 128.0496 159.3223 178.7411 200.6298 230.5018 248.8653 249.5542 263.9580 325.0783 351.8826 360.2031 376.5868 379.0505 416.0822 422.8942 449.9550 473.8274 481.1005 494.0591 499.9684 500.5221 518.8992 521.6799 554.7488 563.9075 566.1215 615.3797 634.0375 646.3698 646.6797 694.7462 719.3701 720.5533 749.8873 753.0873 755.6324 762.9410 794.9568 799.2807 859.3716 884.9727 900.8100 914.6488 919.9735 931.1280 943.4249 963.1073 968.6285 983.7423 995.4348 1004.9338 1020.8186 1028.5877 1048.3173 1094.8328 1107.3138 1113.0916 1124.9524 1131.1146 1169.1078 1194.6557 1208.1177 1217.1494 1251.1409 1266.7066 1312.4343 1342.6681 1410.0176 1415.5522 1423.8900 1450.0207 1452.6988 1490.3667 1491.8334 1506.3933 1509.6515 1520.4930 1578.8804 1583.8304 1585.1741 1585.3910 1602.7473 1613.8828 1619.9379 1630.4203 1640.3680 3007.5565 3045.6464 3115.3091 3120.6011 3137.0256 3139.1581 3140.2478 3158.6894 3476.5310 3476.6385 3564.8865 3565.3609 3684.4895 3684.6140 3721.1494 3721.2792
redmass: 1.3614 1.3738 4.8211 4.2889 5.3549 3.5939 5.0977 2.9101 4.8408 3.4904 3.6368 5.0895 4.5038 3.8112 3.6570 5.7767 5.1070 4.1958 2.1558 2.3852 1.4729 1.8429 3.5724 2.8778 3.9867 2.4916 3.2739 2.2290 1.6326 1.1783 3.5772 2.5040 7.0110 5.9200 3.5270 6.6151 4.7872 2.5219 2.5123 7.3649 1.5696 1.5551 4.5412 5.7201 1.2522 5.3093 2.4078 4.4412 1.3781 4.6523 1.4908 5.2071 4.6177 1.8856 2.2739 1.4667 3.9904 1.3458 2.0897 1.7066 2.3037 1.7847 2.1709 2.1980 1.1742 3.1489 4.1139 1.7076 1.0780 3.1835 2.0750 1.3718 1.8660 2.2634 6.1006 1.9360 4.2556 1.2675 2.5120 4.3571 3.3473 1.9310 1.9448 3.7403 3.9163 3.3438 1.8545 3.7166 3.6266 2.7668 2.3550 6.2664 1.6412 2.4170 8.1001 1.0623 1.0968 1.0852 1.0887 1.0925 1.0938 1.0916 1.1003 1.0497 1.0497 1.0450 1.0451 1.0983 1.0984 1.1048 1.1048
irintensity: 7.9251 0.0051 8.0043 0.0009 2.4242 0.9427 0.1768 0.0001 0.0000 3.4270 22.4868 0.0691 3.7358 0.0001 28.2086 3.9884 1.8980 5.5848 0.0007 218.8206 670.1084 0.0002 7.9744 4.3080 6.5053 21.8505 4.7463 0.0004 0.0631 69.1167 33.2246 6.3524 0.0901 2.5358 0.0000 3.5744 14.5367 0.0215 40.2582 0.1117 0.0710 220.8239 0.0000 0.5094 63.8815 0.0974 0.0000 0.0257 0.0000 0.6627 58.2086 88.5238 113.7964 0.0000 0.3396 18.1980 15.3359 0.0000 0.3823 2.2113 8.6479 0.0402 2.5363 7.3454 0.0000 181.1611 118.3834 25.6979 0.7640 19.4770 21.0968 0.1213 2.7779 6.9018 3.8191 27.9234 13.5281 8.6220 0.0732 33.8614 38.0091 149.1581 11.2260 2.8057 736.4157 1005.0929 1067.1598 10.7818 183.6201 0.4920 189.8685 3.0959 582.7863 624.6955 3.8146 0.0517 4.8076 6.5365 0.0080 0.5440 51.2482 0.0033 63.6142 8.1319 50.8747 37.6974 203.8562 149.6685 22.6375 78.3451 3.9302
temp: 298.150 k
press: 1.00000 atm
elementType: 7 7 7 7 7 7 7 7 6 6 6 6 6 6 6 6 6 6 6 6 6 6 6 1 1 1 1 1 1 1 1 1 1 1 1 1 1 1 1
symmnumber: 1
zpe: 792117.2 jmol-1
zpe.correction: 0.301702 hartree
zpe.thermalcorrener: 0.321732 hartree
zpe.thermalcorrenthalpy: 0.322676 hartree
zpe.thermalcorrgfe: 0.252516 hartree
zpe.sumelectzpe: -1017.580826 hartree
zpe.sumelectthermal: -1017.560796 hartree
zpe.sumelectthermalent: -1017.559852 hartree
zpe.sumelectthermalfe: -1017.630012 hartree
dipole: 4.4424 0.0014 -0.0008
dipole: 4.4424
quadrupole: -99.3787 -55.8191 -143.6877
quadrupole: -0.0178 0.0002 0.0104
quadrupole: 0.2499 43.8094 -44.0592 -0.0178 0.0002 0.0104
hfenergy: -1017.8825278 hartree
pointgroup: C01 [X(C15H16N8)]
dipole: -1.7477281 -0.010465 0.0003142 debye
polarizability: 463.2704442|0.4908006|382.7020368|-0.0044165|-0.0089247|89.8279486 unknown
InChI: InChI=1S/C15H16N8/c16-14(17)22-20-12-7-13(21-23-15(18)19)11-6-9-4-2-1-3-8(9)5-10(11)12/h1-6H,7,16-19H2
charge 0 multiplicity 1
39 atoms
N  -1.256902 -2.48809 -0.000025
N  -1.286318 2.471406 -0.000064
N  -2.653085 -2.738393 0.000009
N  -2.685395 2.705122 -0.000054
N  -4.211247 -4.470995 -0.000035
N  -1.893149 -5.015172 0.000227
N  -4.264055 4.418983 0.000337
N  -1.95257 4.990771 -0.000567
C  0.451072 -0.722448 -0.000043
C  0.442455 0.726073 -0.000052
C  -1.883563 -0.011953 -0.000032
C  -0.937423 -1.207452 -0.000036
C  -0.951658 1.19464 -0.000054
C  2.89862 -0.712687 -0.000029
C  2.889907 0.745806 -0.000034
C  1.657301 -1.427321 -0.000031
C  1.640087 1.44545 -0.000043
C  4.161935 -1.394197 -0.000017
C  4.144901 1.442499 -0.000026
C  5.365284 -0.684829 -0.00001
C  5.356708 0.747711 -0.000016
C  -2.889529 -4.065622 0.000088
C  -2.937583 4.02944 -0.000103
H  -2.559661 -0.015966 -0.875464
H  -2.559649 -0.015956 0.875409
H  1.657416 -2.522783 -0.000024
H  1.626938 2.54083 -0.000044
H  4.166643 -2.491087 -0.000014
H  4.136317 2.539365 -0.00003
H  6.321442 -1.21999 -0.000002
H  6.306376 1.294298 -0.00001
H  -4.913461 -3.735496 -0.000079
H  -4.490359 -5.446196 0.000659
H  -2.055124 -6.016333 0.00013
H  -0.950177 -4.615517 0.000256
H  -4.957382 3.675098 0.000628
H  -4.554897 5.390755 -0.001096
H  -2.126412 5.989938 0.000459
H  -1.004902 4.602396 -0.000668
