program: Gaussian 09
title: 000127499
version: EM64L-G09RevD.01
frameworkgroup: C1[X(C7H8ClN5O)]
method: RPBEPBE
basis: SDD
operation: Freq
keyword: #p
keyword: freq=noraman
keyword: PBEPBE/SDD
title: #p freq=noraman PBEPBE/SDD
converged: YES YES NO NO
title: Mulliken charges:
elementType: Cl O N N N N N C C C C C C C H H H H H H H H
charge: -0.055193 -0.262026 -0.379709 -0.047805 -0.116420 -0.010971 -0.593440 0.086371 0.197237 -0.064816 -0.178699 -0.224313 -0.022223 -0.598637 0.327927 0.232407 0.253836 0.263934 0.259633 0.273497 0.335345 0.324063
chargesum: 0.00000
title: Mulliken charges with hydrogens summed into heavy atoms:
elementType: Cl O N N N N N C C C C C C C
charge: -0.055193 -0.262026 -0.051782 -0.047805 -0.116420 -0.010971 0.065968 0.086371 0.197237 -0.064816 0.307545 0.039621 -0.022223 -0.065507
polarizability: 1.48260159e+02 1.41197262e+00 1.56705982e+02 5.73416447e+00 1.46375509e+00 6.73675552e+01
1716.lowfreq: -9.5252 -3.5668 -0.0013 -0.0008 0.0016 4.0421 22.2881 41.4762 94.8618
frequency: 22.0554 41.4570 94.8522 119.4370 138.2216 201.1296 239.6901 250.9904 294.4768 337.5734 352.6162 393.8943 428.2450 493.2132 517.5053 532.3862 583.2756 601.2171 611.1586 616.7778 658.8145 697.0734 718.6412 779.9361 781.0914 822.3470 832.1182 906.2145 933.4334 980.5377 998.5839 1024.2728 1073.4766 1083.1538 1105.8931 1171.5035 1189.5630 1219.4045 1265.9054 1296.7222 1309.6447 1335.7371 1343.1783 1368.3580 1392.7779 1434.0267 1437.2055 1454.2837 1485.0888 1527.8923 1603.1957 1632.7329 2996.6755 3062.4697 3077.4400 3146.0962 3235.5139 3567.8852 3596.5496 3727.5839
redmass: 6.9792 9.1320 4.9631 5.0422 5.6290 7.0581 8.7262 2.4344 3.7073 3.4123 8.0958 3.7037 1.1798 5.3675 1.0692 8.6685 2.8099 5.9098 4.2603 1.7414 3.2880 4.9778 11.8696 8.5532 8.8402 2.8937 1.4917 7.6480 2.2039 1.7988 5.5293 2.6457 1.9965 2.0059 3.9064 1.1728 2.4626 1.1690 3.3566 1.2156 5.1966 2.7738 3.1765 2.0208 4.2100 2.4867 1.2383 1.1021 3.2622 8.0187 1.5491 7.8914 1.0612 1.0624 1.0967 1.1099 1.0987 1.0442 1.0825 1.1059
irintensity: 3.4643 2.2279 1.6135 4.4841 18.6867 0.5404 0.0096 1.9093 4.6924 8.9739 1.7126 23.3009 288.5004 0.1236 22.4257 0.8363 86.2336 12.5972 30.3784 31.7125 15.5948 15.0798 4.4961 5.5417 0.1468 9.9905 24.2755 3.0103 14.2196 5.0375 11.4487 63.9398 12.6576 16.0934 110.5060 0.4312 48.8578 0.6138 124.8433 34.0882 86.2435 202.6939 33.7808 38.4886 8.8403 12.5661 11.1541 38.2347 97.0978 477.0644 282.2443 332.4438 20.9781 14.2548 16.3784 9.1636 1.5408 119.1127 63.5039 46.4297
temp: 298.150 k
press: 1.00000 atm
elementType: 17 8 7 7 7 7 7 6 6 6 6 6 6 6 1 1 1 1 1 1 1 1
symmnumber: 1
zpe: 419549.5 jmol-1
zpe.correction: 0.159798 hartree
zpe.thermalcorrener: 0.172170 hartree
zpe.thermalcorrenthalpy: 0.173114 hartree
zpe.thermalcorrgfe: 0.119153 hartree
zpe.sumelectzpe: -1079.572419 hartree
zpe.sumelectthermal: -1079.560047 hartree
zpe.sumelectthermalent: -1079.559103 hartree
zpe.sumelectthermalfe: -1079.613064 hartree
dipole: 3.6868 1.1735 2.2217
dipole: 4.4616
quadrupole: -108.4978 -63.1737 -88.4095
quadrupole: 0.4621 5.7322 -1.9786
quadrupole: -21.8041 23.5200 -1.7159 0.4621 5.7322 -1.9786
hfenergy: -1079.7322173 hartree
pointgroup: C01 [X(C7H8Cl1N5O1)]
dipole: 1.5355063 -0.2747379 -0.8049342 debye
dipolederiv: -0.2959061 -0.0801229 -0.0609943 -0.1609283 -0.291366 -0.1278812 -0.1651093 -0.164085 -0.3583013 -1.9620305 -0.0125156 0.1048331 -0.1145951 -0.3797934 0.0227062 0.1937078 0.0220349 -0.3052035 -0.4986472 -0.2033814 0.0394166 -0.1022739 -0.513823 0.0301478 0.0398965 0.0412645 -0.2234846 -0.3513742 0.116573 -0.0030458 -0.1680567 -0.7266157 0.0427505 0.0155668 0.0104239 -0.2827909 -0.7819446 -0.4607219 0.0587641 -0.2590332 -1.0427984 0.0549199 0.0859038 0.0936958 -0.2194387 -0.4452888 0.4182579 -0.0119471 -0.259049 -1.1356556 0.064285 0.0307053 0.0115403 -0.2473595 -0.18967 -0.236181 -0.0433353 -0.2151401 -1.6608841 0.0591879 -0.0413082 0.0660735 -0.7314717 -0.9710819 0.2055599 0.0629545 0.2362124 0.1342878 -0.0334287 0.0742054 -0.018051 0.0175485 2.0543207 0.0532835 -0.1241696 0.1792449 0.884265 -0.0396169 -0.2143966 -0.0443997 0.222583 0.4978145 -0.3025761 -0.0128716 0.248173 1.0414857 -0.0677508 -0.0545211 -0.0226629 0.0820513 0.9155714 -0.1200686 -0.0090489 -0.5132199 0.194768 -0.0183619 -0.103484 -0.0413247 0.2094586 0.6649298 0.2196458 -0.0822815 0.2680386 0.2277619 -0.0350683 -0.081905 -0.0346459 -0.0397869 0.5103965 0.2099162 -0.0339834 0.3496382 2.1585213 -0.1252398 -0.0479515 -0.1354125 0.186095 0.2370468 0.1135911 0.1462348 0.2015297 0.3622082 0.2471147 0.2384181 0.2405626 0.4800909 0.176951 0.0209658 0.0155854 0.0119974 0.2338106 0.0001735 0.0136058 -0.0027198 0.3576137 -0.049913 -0.0515673 -0.057457 0.1052603 0.006214 -0.0917199 0.0307463 -0.0870108 -0.0197379 -0.0162144 -0.0047742 0.0236161 0.124441 0.0328311 0.0527797 0.0067586 0.089457 -0.0275526 0.1106356 0.0174131 0.0055913 0.0211908 -0.0129991 0.0067398 0.0052717 0.0067863 0.1790813 -0.0609894 0.0508969 -0.0050022 0.0629711 -0.021173 -0.0862177 -0.0321676 -0.0682416 0.0341131 0.109209 -0.0042982 -0.0540819 -0.0689436 -0.0078988 0.0296829 -0.0324487 0.0208619 -0.0890451 0.1884297 0.0845436 0.0166041 0.0447992 0.2437419 0.0056874 0.0178852 0.0031996 0.3919612 0.1577549 -0.0344393 0.0246184 0.0077434 0.2731117 0.0091098 0.0206206 0.0126535 0.383576 unknown
polarizability: 149.0694848|-2.3199563|156.1921887|-1.8093334|2.879384|67.0720227 unknown
InChI: InChI=1S/C7H8ClN5O/c8-1-2-14-6-4-5(11-3-10-4)12-7(9)13-6/h3,10H,1-2,9H2
charge 0 multiplicity 1
22 atoms
Cl 4.502503 1.077651 1.02839
O  1.66859 0.325024 -0.323184
N  -0.817808 2.159675 -0.15136
N  -2.93777 1.319645 0.09047
N  0.133895 -1.476306 -0.067065
N  -2.293306 -1.079603 0.145309
N  -1.387986 -3.241867 0.179996
C  -0.685229 0.768932 -0.102128
C  0.376999 -0.155533 -0.160639
C  -2.015698 0.253549 0.050396
C  2.751993 -0.68387 -0.311716
C  -2.181969 2.42718 -0.03084
C  -1.19021 -1.881708 0.084432
C  4.060834 0.056884 -0.494375
H  -0.059284 2.833751 -0.241119
H  2.595627 -1.390582 -1.150698
H  2.71785 -1.256279 0.631381
H  -2.575776 3.441512 -0.036257
H  4.892857 -0.651357 -0.625514
H  4.017981 0.769051 -1.331171
H  -2.336098 -3.588689 0.295198
H  -0.590995 -3.869559 0.144795
