program: Gaussian 09
title: 000127592
version: EM64L-G09RevD.01
frameworkgroup: C1[X(C18H24N2O7S)]
method: RPBEPBE
basis: SDD
operation: Freq
keyword: #p
keyword: freq=noraman
keyword: PBEPBE/SDD
title: #p freq=noraman PBEPBE/SDD
converged: YES YES NO NO
title: Mulliken charges:
elementType: S O O O O O O O N N C C C C C C C C C C C C C C C C C C H H H H H H H H H H H H H H H H H H H H H H H H
charge: 0.911954 -0.460262 -0.435458 -0.546606 -0.530546 -0.510576 -0.474181 -0.187113 -0.579179 -0.190774 -0.113591 -0.184698 -0.153362 -0.057961 -0.288553 0.489878 -0.408621 0.161473 -0.031377 0.321729 -0.298184 -0.424968 -0.371512 -0.263640 -0.413390 -0.280765 -0.666968 -0.656194 0.247029 0.297689 0.223348 0.299601 0.341775 0.218890 0.261537 0.199891 0.385016 0.306722 0.356122 0.283650 0.276625 0.247592 0.385449 0.259127 0.241079 0.370886 0.232209 0.266733 0.234318 0.215726 0.237086 0.255346
chargesum: 0.00000
title: Mulliken charges with hydrogens summed into heavy atoms:
elementType: S O O O O O O O N N C C C C C C C C C C C C C C C C C C
charge: 0.911954 -0.075246 -0.079336 -0.161157 -0.530546 -0.510576 -0.103295 -0.187113 -0.237403 -0.190774 0.133438 0.112991 0.069986 0.241640 -0.288553 0.489878 0.071806 0.161473 0.168514 0.321729 0.008538 -0.141318 -0.094887 -0.016049 -0.154262 -0.039687 0.066293 0.051964
polarizability: 3.37872208e+02 -2.96571871e+01 2.15303862e+02 -1.87140055e+00 -1.35319415e+01 2.46711253e+02
1716.lowfreq: -7.2117 -0.0012 -0.0010 0.0008 3.8320 6.9724 18.6947 25.6163 32.1990
frequency: 18.5004 25.5701 32.0498 40.8034 48.6810 68.1192 75.5049 82.6523 98.0285 111.8186 124.0155 134.2800 141.6713 145.2313 158.8958 168.6305 170.7385 177.5591 195.8803 216.7716 227.7085 232.9804 242.8273 254.4711 260.4993 287.7147 297.5294 299.1178 319.1953 323.5919 336.7113 339.1792 349.2013 367.5383 377.8791 407.7493 415.2644 430.9997 460.4323 469.6851 487.7011 502.8157 506.7848 521.6561 535.2706 576.1019 585.4030 586.7387 606.1598 627.1180 669.5520 694.3957 705.7263 720.6233 742.0975 753.2864 779.0560 795.2757 797.0923 804.7233 824.4907 827.9801 833.3936 840.2965 882.7862 892.3872 903.2454 924.2728 930.4737 944.3742 951.8265 963.6015 974.2088 991.0191 994.8258 1002.7712 1038.1360 1039.5127 1058.2910 1064.8763 1069.5478 1092.2782 1093.0069 1100.3721 1117.5277 1127.8079 1147.5573 1161.0332 1177.9285 1192.9254 1197.6654 1206.0239 1210.6645 1213.5318 1241.0419 1259.0184 1263.3278 1285.0154 1304.3633 1323.4735 1338.3504 1340.1016 1349.3839 1359.5400 1361.3809 1366.0006 1369.0130 1377.6365 1381.4864 1385.6087 1398.2917 1430.1537 1432.7209 1440.8708 1451.5982 1463.3498 1463.8052 1471.9319 1481.1853 1484.8169 1499.5408 1511.1671 1575.4640 1580.6413 1617.1774 1635.9295 2911.3182 2919.7197 2943.9967 2964.5167 3002.5684 3011.3530 3022.8988 3023.5936 3039.0719 3042.7102 3094.3989 3111.9042 3120.0031 3141.9836 3146.6764 3159.9351 3167.8413 3179.3119 3181.4070 3213.9038 3238.2691 3474.0507 3486.8723 3529.3163
redmass: 6.4302 5.1411 6.4874 5.6506 4.8549 5.6022 3.8190 3.4032 7.3023 7.6948 5.1556 5.3494 3.1564 3.3629 6.4689 3.9812 3.4298 4.7120 5.5622 4.6255 3.0920 3.1220 3.0999 1.4869 2.8956 3.6198 4.4204 3.2869 5.8944 4.6955 4.4286 3.8268 5.5218 3.1173 7.4294 1.1429 9.2561 1.3242 5.4004 3.5606 4.1831 3.4584 4.2252 5.4912 5.5007 4.4635 2.6530 3.3490 1.3362 1.1379 4.9355 3.4839 4.2028 6.6640 1.6633 3.1145 5.0143 8.2638 3.9770 1.4125 4.0317 3.0556 4.7052 2.9578 1.4507 1.6336 2.5410 4.8657 4.9290 4.8579 1.3699 3.3180 1.3389 2.2219 1.3379 2.4935 2.2760 3.0693 1.4949 2.5762 2.1354 1.5296 2.8212 1.5562 3.4291 1.4181 1.1847 1.6206 1.4214 1.5252 1.3654 1.8827 1.3807 2.0325 1.3143 1.8586 1.2663 1.1677 1.2975 1.2562 1.8870 1.2786 1.2401 1.2075 1.2086 1.2708 3.0744 1.2518 3.9881 1.7103 2.4205 2.5976 1.1724 1.6149 1.1602 1.1942 1.2886 1.0626 1.1114 1.0729 1.5831 2.1204 6.2975 5.1194 7.0688 8.5118 1.0803 1.0497 1.0437 1.0896 1.0850 1.0644 1.0850 1.0947 1.0822 1.0855 1.1014 1.1008 1.0963 1.0878 1.0877 1.0919 1.0920 1.0971 1.0970 1.0717 1.0681 1.0651 1.0668 1.0651
irintensity: 0.3483 0.3347 1.3783 0.3900 5.0053 0.1290 2.4319 7.5703 1.1235 1.3376 2.9863 3.1442 0.1158 13.2194 7.1010 1.4353 6.3613 6.8330 1.1660 18.7269 11.6721 4.0895 2.0634 1.0391 4.3661 5.2551 3.4913 4.9378 10.9885 16.5509 13.3809 11.3039 3.7779 1.8561 14.7807 120.0214 60.1372 56.1096 49.8690 5.1323 12.7201 4.7762 28.8487 25.6751 0.7413 4.4411 45.2323 9.0391 72.3947 181.8034 3.2042 12.0068 16.2133 5.5832 2.6503 9.3477 2.0058 55.9901 64.3722 135.7570 0.9743 3.8450 42.1460 74.9990 9.2301 130.1489 29.8304 40.1409 30.2001 58.2022 2.2227 2.9405 2.6050 15.4812 4.2679 64.8363 80.1522 32.2140 15.1187 31.8308 24.5123 4.9327 45.7512 0.6840 21.0071 40.6459 46.7742 5.6071 13.8658 1.9421 33.7222 12.1641 18.0709 27.0055 25.3137 11.3727 61.6868 29.6829 7.5402 13.2931 12.5190 10.3566 2.9258 11.7375 4.5355 43.5443 32.2243 8.4002 57.5130 21.9416 23.3523 35.1098 6.6703 44.2129 114.6728 4.9931 20.1641 38.5054 14.9371 15.2111 7.2101 53.5394 144.9596 25.4301 11.8377 136.2722 21.9712 105.0039 136.3065 79.2780 45.4536 14.6273 3.8248 33.6809 25.1179 21.3512 18.9001 14.1671 17.2528 8.7719 5.5848 4.0648 7.2735 11.2666 6.1997 116.1179 278.1519 47.0381 86.1742 18.6243
temp: 298.150 k
press: 1.00000 atm
elementType: 16 8 8 8 8 8 8 8 7 7 6 6 6 6 6 6 6 6 6 6 6 6 6 6 6 6 6 6 1 1 1 1 1 1 1 1 1 1 1 1 1 1 1 1 1 1 1 1 1 1 1 1
symmnumber: 1
zpe: 1060459.0 jmol-1
zpe.correction: 0.403908 hartree
zpe.thermalcorrener: 0.433166 hartree
zpe.thermalcorrenthalpy: 0.434110 hartree
zpe.thermalcorrgfe: 0.343706 hartree
zpe.sumelectzpe: -1732.100273 hartree
zpe.sumelectthermal: -1732.071014 hartree
zpe.sumelectthermalent: -1732.070070 hartree
zpe.sumelectthermalfe: -1732.160475 hartree
dipole: -9.9937 2.3064 2.2410
dipole: 10.4984
quadrupole: -158.7433 -201.6321 -169.8559
quadrupole: 6.1577 8.2517 -13.5088
quadrupole: 18.0005 -24.8883 6.8878 6.1577 8.2517 -13.5088
hfenergy: -1732.5041806 hartree
pointgroup: C01 [X(C18H24N2O7S1)]
dipole: -3.7750549 -1.3670808 -0.9696346 debye
polarizability: 324.6128652|46.3302504|237.5669017|10.0038387|-18.7428366|237.7075553 unknown
InChI: InChI=1S/C18H24N2O7S/c1-20(2)14-7-3-6-12-11(14)5-4-8-16(12)28(26,27)19-13(9-21)17(24)18(25)15(23)10-22/h3-9,13,15,17-19,22-25H,10H2,1-2H3
charge 0 multiplicity 1
52 atoms
S  1.233945 2.292391 0.73941
O  4.26538 -1.567472 -0.403599
O  2.416629 -2.136548 -2.725323
O  2.101816 -2.967428 0.026576
O  1.841435 3.345237 -0.357636
O  1.013348 2.714673 2.293959
O  -0.612721 -3.328065 0.01554
O  4.931456 1.268269 1.50187
N  2.340707 0.746646 0.781284
N  -4.455227 -1.159391 0.005253
C  3.454374 -0.581369 -1.125012
C  3.353603 0.742621 -0.299569
C  2.120351 -1.190618 -1.638563
C  1.273218 -1.871512 -0.542161
C  -0.36747 1.617071 -0.030501
C  -1.175539 0.661364 0.667403
C  -0.028834 -2.498908 -1.063735
C  -2.374819 0.210917 -0.028791
C  4.754557 1.002612 0.292151
C  -3.240635 -0.774927 0.611594
C  -0.643652 2.112087 -1.299358
C  -0.831112 0.101079 1.940506
C  -2.622569 0.677922 -1.360343
C  -1.789404 1.610416 -1.983602
C  -2.802992 -1.37116 1.816366
C  -1.618431 -0.924325 2.469521
C  -5.463023 -0.143684 -0.380444
C  -5.045645 -2.460048 0.361783
H  4.041373 -0.331084 -2.031116
H  3.141862 1.582618 -1.003156
H  1.514469 -0.39983 -2.117533
H  1.06695 -1.136494 0.257101
H  2.827747 0.854897 1.705117
H  -0.738528 -1.723954 -1.409322
H  0.187328 -3.195662 -1.888156
H  5.599019 0.931732 -0.42869
H  3.646658 -2.209561 0.067073
H  0.02408 2.850562 -1.755284
H  2.986098 -2.850625 -2.33357
H  0.035044 0.476983 2.489231
H  -3.46335 0.256088 -1.91687
H  -1.997237 1.944651 -3.0045
H  1.470981 -3.589025 0.481797
H  -3.422233 -2.128638 2.304326
H  -1.34741 -1.37176 3.431815
H  -1.097315 -2.742164 0.65689
H  -6.304197 -0.143832 0.345161
H  -5.024275 0.864619 -0.379245
H  -5.876845 -0.352187 -1.385401
H  -5.569193 -2.4481 1.344516
H  -5.785871 -2.735531 -0.409919
H  -4.267498 -3.241253 0.381956
