program: Gaussian 09
title: 000012089
version: EM64L-G09RevD.01
frameworkgroup: C1[X(C7H8N2O2)]
method: RPBEPBE
basis: SDD
operation: Freq
keyword: #pfreq=noraman
keyword: PBEPBE/SDD
title: #p freq=noraman PBEPBE/SDD
converged: NO YES NO NO
title: Mulliken charges:
elementType: O O N N C C C C C C C H H H H H H H H
charge: -0.451964 -0.269864 -0.402444 -0.577149 0.473129 0.259273 -0.366934 -0.415855 -0.338398 -0.308865 0.099832 0.268756 0.217472 0.264915 0.268598 0.289571 0.306418 0.306370 0.377141
chargesum: 0.00000
title: Mulliken charges with hydrogens summed into heavy atoms:
elementType: O O N N C C C C C C C
charge: -0.074823 -0.269864 -0.112874 0.035639 0.473129 0.259273 -0.098178 -0.198383 -0.073484 -0.040267 0.099832
polarizability: 1.72756313e+02 -2.04204370e+00 9.78334390e+01 1.57182796e-03 -3.33819127e-03 4.30232774e+01
1716.lowfreq: -9.3218 -1.7866 0.0006 0.0006 0.0009 3.9526 68.0268 84.1460 133.3569
frequency: 68.0264 84.1431 133.3560 154.1499 244.8682 265.7375 302.7939 323.1604 327.5097 418.6650 462.2037 497.0158 524.6973 566.2879 580.9268 596.6479 630.7379 687.1942 712.3985 758.9603 822.5644 826.3731 867.1204 973.7814 988.0973 997.5400 1009.2447 1108.3504 1149.2939 1170.3343 1186.2440 1217.5302 1289.3607 1314.4950 1329.8647 1373.3178 1442.4195 1484.1093 1512.7604 1581.3300 1622.5938 1639.2759 1661.4540 3116.3341 3149.7036 3173.9317 3178.2970 3462.3421 3480.6931 3535.6364 3614.5227
redmass: 4.9071 5.6435 4.4661 5.8646 4.4291 2.1561 1.5569 1.3769 4.7598 2.9714 6.6699 2.5866 5.7563 1.1193 1.1669 5.1637 6.9687 3.6442 5.2781 4.4460 5.6549 1.3880 1.5499 1.3550 4.3796 1.3336 2.7011 1.4314 1.5635 2.6844 1.3625 1.1865 1.3389 2.3920 2.6728 4.8570 5.0639 1.6472 3.0016 4.4363 4.1247 6.8637 1.2719 1.0896 1.0892 1.0941 1.0954 1.0726 1.0434 1.0641 1.1076
irintensity: 5.9517 1.6254 4.6893 1.3403 1.1047 10.6085 82.8536 264.7678 56.6370 1.9927 26.4509 20.6200 20.3356 135.1430 12.8311 16.9292 3.8801 79.8556 0.9745 12.7248 0.2236 22.7012 52.6984 0.3781 124.4381 0.0565 208.4660 4.4374 212.8513 12.2590 8.2131 1.8103 16.7293 61.8581 63.9598 86.9766 1.3351 6.1168 104.1496 34.3130 344.5435 297.4751 74.1203 19.7743 0.7590 5.3134 1.4305 36.0963 11.5770 43.2428 6.1615
temp: 298.150 k
press: 1.00000 atm
elementType: 8 8 7 7 6 6 6 6 6 6 6 1 1 1 1 1 1 1 1
symmnumber: 1
zpe: 380522.5 jmol-1
zpe.correction: 0.144933 hartree
zpe.thermalcorrener: 0.155264 hartree
zpe.thermalcorrenthalpy: 0.156208 hartree
zpe.thermalcorrgfe: 0.109117 hartree
zpe.sumelectzpe: -530.675324 hartree
zpe.sumelectthermal: -530.664993 hartree
zpe.sumelectthermalent: -530.664048 hartree
zpe.sumelectthermalfe: -530.711140 hartree
dipole: -5.7426 2.2096 0.0041
dipole: 6.1530
quadrupole: -42.0736 -62.8327 -65.6215
quadrupole: 5.3231 -0.0088 -0.0042
quadrupole: 14.7690 -5.9901 -8.7789 5.3231 -0.0088 -0.0042
hfenergy: -530.8202569 hartree
pointgroup: C01 [X(C7H8N2O2)]
dipole: 2.264 -0.8545124 0.0658432 debye
dipolederiv: -0.913322 -0.473174 -0.0133316 -0.7626959 -0.8670518 -0.0214222 -0.0131856 -0.013202 -0.4372474 -1.113751 0.3229998 -0.0218277 0.4821122 -0.9057326 0.013921 -0.0217545 0.0093027 -0.3483788 -1.1699564 0.1778899 -0.018445 0.203696 0.1652668 0.0048439 -0.0168301 0.0044607 -0.5076531 -0.3923046 0.2508683 -0.0123588 0.564094 -0.4432285 0.0171667 -0.0127567 0.0077733 0.0263776 1.745512 -0.1168271 0.0453231 -0.2662175 0.0509783 -0.0074517 0.0455921 -0.0031878 0.153254 -1.2527156 0.0673964 -0.0343054 0.0837553 -0.2499127 0.0023605 -0.0341993 0.0019059 -0.0445475 -0.5695736 0.0735555 -0.0098832 0.5430291 -0.0662024 0.0153962 -0.010186 0.0018153 -0.2273252 -0.6855946 0.0222445 -0.0127273 -0.4504409 0.064575 -0.0125351 -0.0126965 0.0009436 -0.2436738 0.5593321 0.0223101 0.0186815 0.2181936 0.104576 0.0062786 0.018567 0.0007082 -0.0971657 0.507817 -0.106653 0.0169501 -0.2847387 0.1360247 -0.008046 0.0170483 -0.0029901 -0.0917623 2.4797703 -0.0162889 0.0638991 0.0206741 1.3621669 0.0000353 0.0637901 -0.0008669 0.2268418 0.0630723 -0.0698401 -0.0031007 -0.0674388 0.0029026 -0.0019292 -0.0030898 -0.001891 0.1732701 0.0068758 0.1108476 -0.0044736 0.0919203 -0.0798774 0.0024581 -0.004511 0.0029461 0.1679888 0.0956262 0.0676756 -0.0015168 0.0337873 -0.0091079 0.0009131 -0.001454 0.0019024 0.1496028 0.0816085 -0.0729939 -0.0020779 -0.065309 0.0102892 -0.0018939 -0.0021406 -0.0021165 0.1542715 0.110622 -0.070278 -0.00692 -0.1483977 -0.0459656 -0.0038755 -0.0078381 -0.0014729 0.349268 0.1139109 -0.1365055 0.06627 -0.1892223 0.2542997 -0.0475657 0.0510715 -0.0148794 0.1043625 0.1204858 -0.1371955 -0.0649538 -0.1919369 0.2542124 0.0360582 -0.0501398 0.0064326 0.0971793 0.2125849 0.0839682 -0.005202 0.1851356 0.2617873 0.0052875 -0.0052869 0.0024158 0.3953374 unknown
polarizability: 172.6752631|-1.551005|97.809912|3.6821801|-0.0350961|43.1278543 unknown
InChI: InChI=1S/C7H8N2O2/c8-9-6-3-1-5(2-4-6)7(10)11/h1-4,9-10H,8H2
charge 0 multiplicity 1
19 atoms
O  -3.279731 -1.01859 -0.062799
O  -3.16389 1.301326 -0.060347
N  3.11784 -0.469167 0.118364
N  4.004057 0.604181 0.143907
C  1.729974 -0.291267 0.078692
C  -1.099322 -0.003178 -0.001432
C  1.142405 1.007056 0.062445
C  0.88541 -1.443112 0.054354
C  -0.253055 1.13992 0.022725
C  -0.508403 -1.297031 0.015089
C  -2.558981 0.197148 -0.042875
H  1.801319 1.878866 0.08095
H  1.330926 -2.446054 0.066228
H  -0.71807 2.131585 0.009743
H  -1.156775 -2.177579 -0.003464
H  3.480068 -1.427808 0.130183
H  4.521985 0.796707 -0.714411
H  4.470547 0.798352 1.03092
H  -4.248802 -0.798155 -0.090273
