program: Gaussian 09
title: 000130336
version: EM64L-G09RevD.01
frameworkgroup: C1[X(C5H7NO2)]
method: RPBEPBE
basis: SDD
operation: Freq
keyword: #pfreq=noraman
keyword: PBEPBE/SDD
title: #p freq=noraman PBEPBE/SDD
converged: YES YES NO NO
title: Mulliken charges:
elementType: O O N C C C C C H H H H H H H
charge: -0.234660 -0.169975 -0.385500 -0.133664 -0.449575 -0.519307 0.162955 -0.067983 0.270772 0.256392 0.242636 0.262506 0.255103 0.327994 0.182304
chargesum: 0.00000
title: Mulliken charges with hydrogens summed into heavy atoms:
elementType: O O N C C C C C
charge: -0.234660 -0.169975 -0.057506 0.137108 0.049453 -0.001698 0.162955 0.114322
polarizability: 8.59393330e+01 -3.41158495e-01 5.56926308e+01 -5.03740341e+00 -7.96783046e-01 4.80365326e+01
1716.lowfreq: -12.5329 -0.0014 -0.0013 -0.0011 6.1830 11.4516 62.7094 78.6186 131.1933
frequency: 62.6373 78.5379 131.1625 288.5092 358.6924 406.8434 454.6493 510.3504 600.8196 647.6332 735.6861 801.3244 868.2253 886.3239 929.6770 995.9611 1006.1643 1065.7958 1090.5802 1162.7334 1193.8653 1230.2309 1252.4396 1278.3880 1298.5943 1328.1984 1371.4837 1380.1475 1456.8607 1477.7333 1645.1487 1670.4069 2867.9052 3021.1918 3028.3934 3043.3836 3085.2625 3102.2062 3568.7071
redmass: 4.7817 4.4123 2.4957 2.1066 3.7636 7.9854 5.2716 1.7549 2.6468 1.9401 2.7560 2.4198 3.7185 2.4240 1.8193 2.1563 2.3071 2.1609 2.6789 1.3461 1.3211 1.7833 1.7678 1.4095 1.2912 1.6020 1.2957 1.6640 1.0827 1.0881 8.3470 8.7401 1.0860 1.0624 1.0675 1.0833 1.1016 1.1024 1.0787
irintensity: 14.5123 4.3497 2.4610 1.0665 14.7363 6.2387 9.6702 22.4373 34.5260 104.4767 10.2817 8.9193 3.7237 1.3953 5.7307 10.4470 18.6159 8.0561 17.1844 5.6031 7.8003 64.1409 69.5484 4.5156 4.3365 9.0433 2.6585 19.7987 7.9124 12.4022 143.7488 438.7078 83.1643 12.5287 11.9330 26.4875 4.7308 19.9113 31.9457
temp: 298.150 k
press: 1.00000 atm
elementType: 8 8 7 6 6 6 6 6 1 1 1 1 1 1 1
symmnumber: 1
zpe: 307337.7 jmol-1
zpe.correction: 0.117059 hartree
zpe.thermalcorrener: 0.124616 hartree
zpe.thermalcorrenthalpy: 0.125560 hartree
zpe.thermalcorrgfe: 0.084263 hartree
zpe.sumelectzpe: -399.316751 hartree
zpe.sumelectthermal: -399.309194 hartree
zpe.sumelectthermalent: -399.308249 hartree
zpe.sumelectthermalfe: -399.349547 hartree
dipole: -0.7365 1.9406 0.8381
dipole: 2.2385
quadrupole: -71.0028 -42.6803 -43.9974
quadrupole: 4.0215 0.4912 -1.7636
quadrupole: -18.4426 9.8799 8.5627 4.0215 0.4912 -1.7636
hfenergy: -399.4338098 hartree
pointgroup: C01 [X(C5H7N1O2)]
dipole: 0.3446257 -0.7471143 0.3141203 debye
dipolederiv: -1.2074778 0.1544785 -0.1964588 0.3423927 -0.5784537 0.0321733 -0.2040436 -0.028428 -0.4144499 -1.0160311 -0.194612 -0.0042102 -0.1840693 -0.3243883 0.0208836 -0.0762245 0.0274093 -0.4115139 -1.0117386 -0.0666385 -0.1298397 -0.3798732 -0.4330408 -0.085722 -0.2341434 0.002109 -0.6012974 0.2087388 -0.1805983 0.0534684 -0.380719 0.0872788 -0.0026791 0.1362659 0.0487477 0.190732 0.0752178 -0.0415313 -0.0474471 0.0765372 0.0825644 -0.0292176 0.0483409 -0.0013578 0.0788912 -0.0440703 0.1301249 -0.0222181 0.1474388 -0.3191855 -0.1155323 -0.0138236 -0.1272471 0.0707895 1.6907717 -0.1251718 0.4496122 0.0356469 0.8437987 0.2446242 0.5846985 0.2303428 0.4225565 1.1695291 0.3161788 0.0531458 0.3668471 0.1563823 -0.1333931 -0.1077542 -0.2557799 0.6355718 -0.0373409 -0.0037914 -0.0712036 0.0197978 0.0733263 -0.0069088 -0.0558931 -0.0027678 -0.0878905 0.0467146 -0.0495223 0.0272699 -0.0354212 0.0097734 0.0776348 -0.0095933 0.0948858 -0.0629985 -0.0399449 0.0989742 0.0513427 0.0729679 0.0415905 -0.0395694 0.0670911 -0.0612176 0.0417081 -0.0198731 -0.0932498 0.0080084 -0.0807234 0.0227664 0.0162155 0.0083785 0.0402566 0.0995595 0.0670034 0.0290753 0.0267273 0.0033091 0.0872886 0.0174273 -0.0069707 -0.0048046 -0.0911331 0.1412749 0.0172884 -0.0650513 0.0307346 0.16187 -0.0529292 -0.0720077 -0.0402636 0.3254846 -0.0227735 0.0089953 -0.1331457 -0.034866 0.088429 0.0569929 -0.0643207 0.0781152 -0.1960099 unknown
polarizability: 85.0359938|2.2221753|55.766043|7.1380294|1.7773859|48.8664598 unknown
InChI: InChI=1S/C5H7NO2/c7-3-4-1-2-5(8)6-4/h3-4,6H,1-2H2
charge 0 multiplicity 1
15 atoms
O  -2.67108 0.727808 -0.303635
O  3.010301 0.783721 0.010787
N  -0.494337 0.86813 0.594995
C  0.750218 0.095795 0.712956
C  0.285313 -1.362398 0.337218
C  -1.038886 -1.17951 -0.444962
C  -1.543399 0.225442 -0.064962
C  1.805059 0.607858 -0.276494
H  1.177602 0.134482 1.730563
H  0.110342 -1.922007 1.271325
H  1.059184 -1.901564 -0.234029
H  -1.805452 -1.927711 -0.188235
H  -0.89933 -1.21623 -1.540835
H  -0.587609 1.830437 0.923729
H  1.402675 0.816446 -1.302919
