program: Gaussian 09
title: 000012084
version: EM64L-G09RevD.01
frameworkgroup: C1[X(C7H6ClNO)]
method: RPBEPBE
basis: SDD
operation: Freq
keyword: #p
keyword: freq=noraman
keyword: PBEPBE/SDD
title: #p freq=noraman PBEPBE/SDD
converged: YES YES NO NO
title: Mulliken charges:
elementType: Cl O N C C C C C C C H H H H H H
charge: -0.045149 -0.275656 -0.636271 0.303086 -0.307994 -0.342585 -0.221781 -0.209115 -0.094795 0.163244 0.203550 0.286842 0.258267 0.261013 0.316398 0.340946
chargesum: 0.00000
title: Mulliken charges with hydrogens summed into heavy atoms:
elementType: Cl O N C C C C C C C
charge: -0.045149 -0.275656 0.021073 0.303086 -0.104444 -0.055743 0.036486 0.051897 -0.094795 0.163244
polarizability: 1.47715056e+02 1.05397099e+00 9.50198519e+01 -5.85412577e-04 -1.50960494e-02 3.64898271e+01
1716.lowfreq: -35.6692 -6.0014 -4.1295 -0.0033 -0.0030 -0.0016 4.4056 85.9275 173.6485
frequency: -35.5067 85.9228 173.6484 255.3815 297.0191 299.4915 391.5304 443.3377 455.3748 485.7784 496.0695 583.4745 615.9741 624.5618 683.6614 741.0952 753.3578 816.6693 857.2727 941.1469 996.6619 998.7465 1044.7867 1073.6584 1111.8793 1123.6388 1189.1365 1295.4075 1352.7484 1373.7726 1395.4949 1477.9339 1561.8249 1595.4148 1598.2947 1637.3824 3130.2580 3158.1396 3173.2016 3178.1561 3534.4643 3687.0476
redmass: 3.9139 8.7424 7.5935 6.0486 12.4746 5.1000 2.2029 1.9737 3.5677 1.7258 7.8973 1.2784 4.5054 6.5315 3.4220 3.0302 5.4771 1.4851 1.5173 1.3946 1.3531 4.3355 1.9177 3.0961 1.7469 1.9149 1.1354 1.2537 3.7707 5.7755 4.0069 2.4355 4.5788 2.9148 5.2599 2.0341 1.0893 1.0888 1.0952 1.0971 1.0450 1.1037
irintensity: 12.8883 0.6441 8.0102 0.0585 0.2472 7.8521 5.6666 5.8048 4.6971 159.5808 24.0211 78.9244 2.3469 0.5528 59.7842 60.5113 26.4677 12.0725 36.9828 0.0445 1.7594 38.2447 2.2822 37.5406 6.6648 15.8600 3.6847 3.2084 239.3824 44.2380 23.4287 25.2094 78.0327 91.4349 35.2481 257.1635 18.5468 0.4487 4.7128 1.9422 42.3740 31.6790
temp: 298.150 k
press: 1.00000 atm
elementType: 17 8 7 6 6 6 6 6 6 6 1 1 1 1 1 1
symmnumber: 1
zpe: 303186.5 jmol-1
zpe.correction: 0.115478 hartree
zpe.thermalcorrener: 0.123520 hartree
zpe.thermalcorrenthalpy: 0.124464 hartree
zpe.thermalcorrgfe: 0.082098 hartree
zpe.sumelectzpe: -859.685818 hartree
zpe.sumelectthermal: -859.677777 hartree
zpe.sumelectthermalent: -859.676832 hartree
zpe.sumelectthermalfe: -859.719198 hartree
dipole: 0.5279 3.7031 0.0261
dipole: 3.7407
quadrupole: -68.4420 -56.8910 -68.3286
quadrupole: 13.8148 0.0968 -0.0142
quadrupole: -3.8881 7.6629 -3.7747 13.8148 0.0968 -0.0142
hfenergy: -859.8012961 hartree
pointgroup: C01 [X(C7H6Cl1N1O1)]
dipole: -0.1804539 -1.4605462 0.0099407 debye
dipolederiv: -0.9134611 -0.0123509 -0.0007425 -0.007532 -0.1204949 -0.0001873 -0.000772 -0.0001541 -0.06408 -0.9021073 0.2560408 -0.0015512 0.1266468 -0.8801997 0.0036026 -0.0001136 0.003119 -0.3752386 -0.7660267 -0.4713357 0.0035597 -0.4790035 -0.8345878 -0.0004623 0.0035267 -0.0012685 -0.7066758 -0.5412414 -0.0426195 -0.0005081 0.0482788 -0.0861268 0.0004773 -0.0010922 0.0002238 0.0123514 0.1500243 0.0657816 0.0006634 -0.0861116 0.0575158 0.0010397 0.0018402 0.0013146 -0.1494683 0.0919693 -0.0763423 -0.000057 0.1140592 0.0421835 0.0006658 -0.0002328 -0.0002779 -0.10239 -0.438234 -0.1034655 -0.0006394 -0.1828709 -0.0235862 0.0002033 -0.0006362 0.0003439 -0.1033258 -0.3712168 0.13379 0.000173 0.1362676 0.0075607 0.0003928 0.0001211 0.0004367 -0.110513 1.3361458 0.008839 0.0012938 0.0585781 0.1718853 0.0007623 0.0015203 0.0006443 -0.0598998 1.7020907 0.1784983 -0.0005941 0.260261 1.3688148 -0.0075768 -0.0019463 -0.0060499 0.2475634 0.0047982 -0.1142597 -0.0004253 -0.1106555 -0.0603163 -0.0009101 -0.0007975 -0.0007742 0.1517458 0.1158175 0.0709451 0.0002324 0.0245589 0.044693 -0.0004335 0.0005227 0.0000045 0.1580476 0.0440853 0.0659661 0.0000799 0.0635011 -0.0009113 -0.0005349 0.0000168 -0.0005828 0.1676345 0.048783 -0.0665917 -0.0002719 -0.062609 0.0035479 -0.0005249 -0.0002876 -0.0005343 0.1661612 0.2348818 0.0780533 -0.000932 0.079661 0.1321877 0.0019781 -0.0013324 0.0021913 0.3816422 0.2036915 0.0290512 -0.0002807 0.0169701 0.1778341 0.0015079 -0.0003371 0.0013636 0.3864452 unknown
polarizability: 147.6573209|2.0364406|95.0775292|0.0758185|0.0254101|36.4898847 unknown
InChI: InChI=1S/C7H6ClNO/c8-6-3-1-5(2-4-6)7(9)10/h1-4H,9H2
charge 0 multiplicity 1
16 atoms
Cl 3.915096 0.023324 0.002837
O  -2.832003 1.163736 -0.00887
N  -2.939154 -1.144681 0.003921
C  -0.721368 -0.037386 -0.00126
C  0.016386 -1.249993 -0.004384
C  -0.01606 1.193539 0.002495
C  1.427802 -1.238076 -0.003191
C  1.392564 1.224596 0.003866
C  2.094557 0.002697 0.00115
C  -2.229413 0.045389 -0.002448
H  -0.48124 -2.226391 -0.009127
H  -0.602009 2.118111 0.004083
H  1.997128 -2.171689 -0.005889
H  1.933864 2.174737 0.006928
H  -2.502944 -2.062838 0.012601
H  -3.956407 -1.082175 0.00269
