program: Gaussian 09
title: 000012083
version: EM64L-G09RevD.01
frameworkgroup: C1[X(C8H7NO4)]
method: RPBEPBE
basis: SDD
operation: Freq
keyword: #pfreq=noraman
keyword: PBEPBE/SDD
title: #p freq=noraman PBEPBE/SDD
converged: NO YES NO NO
title: Mulliken charges:
elementType: O O O O N C C C C C C C C H H H H H H H
charge: -0.284007 -0.239540 -0.199920 -0.200851 0.027522 0.251796 0.388893 -0.321578 -0.303080 -0.346593 -0.342974 0.189032 -0.497979 0.282266 0.283243 0.291842 0.290208 0.237238 0.247213 0.247267
chargesum: 0.00000
title: Mulliken charges with hydrogens summed into heavy atoms:
elementType: O O O O N C C C C C C C C
charge: -0.284007 -0.239540 -0.199920 -0.200851 0.027522 0.251796 0.388893 -0.039312 -0.019837 -0.054751 -0.052766 0.189032 0.233740
polarizability: 1.78092872e+02 2.55823924e-01 1.14531218e+02 1.75308306e-02 2.28787145e-02 4.63350278e+01
1716.lowfreq: -8.2739 -0.0011 -0.0009 -0.0002 1.0472 3.4392 45.2014 64.0339 73.7234
frequency: 45.1950 64.0255 73.7207 103.3585 118.6316 152.5737 228.6834 266.0683 272.3617 303.7762 409.5575 443.2172 459.5456 486.8897 516.8605 623.8617 653.7051 677.3748 685.6825 757.1386 764.8079 799.9501 864.4054 889.3300 918.5117 1004.8605 1006.4308 1012.0101 1072.4798 1089.3867 1108.8270 1114.6676 1151.6944 1176.6522 1215.6739 1252.7452 1292.2891 1368.1017 1406.0199 1414.8144 1425.0892 1453.2139 1462.4846 1475.9794 1591.6180 1610.5229 1628.5646 3008.3437 3111.3143 3155.4149 3164.8355 3176.7393 3188.9951 3194.4677
redmass: 7.5511 5.6757 4.2370 1.2064 5.2707 3.9873 6.5004 6.7030 9.2475 4.8806 2.8829 7.3321 4.0537 8.4779 6.2368 7.1185 6.1920 7.7586 3.9204 7.0646 5.0807 7.9767 1.2437 1.6724 8.0591 1.3450 3.2150 1.3692 4.4342 3.2477 1.3293 1.2645 1.4873 1.2448 6.9777 4.9280 1.2613 7.8599 8.4498 4.4786 1.1871 1.0490 1.0511 2.4495 8.5568 6.3901 9.7785 1.0296 1.1047 1.1049 1.0903 1.0891 1.0958 1.0974
irintensity: 0.4973 0.3321 1.0581 1.6064 0.3873 10.0818 9.0818 0.7205 0.3751 16.5639 0.0046 0.9647 1.1258 7.8528 1.5425 0.2839 0.0160 2.1984 60.3729 26.8548 4.1774 17.7639 0.6521 56.8592 6.5997 0.2679 24.5438 0.0001 180.5304 12.4357 11.5612 0.0141 54.0897 7.2502 404.6101 171.0641 0.9362 86.3365 9.4581 65.6059 24.8731 15.7285 11.3217 3.6261 36.1927 4.5779 144.6814 32.0136 23.0916 13.4931 1.1636 1.0055 0.5818 0.5812
temp: 298.150 k
press: 1.00000 atm
elementType: 8 8 8 8 7 6 6 6 6 6 6 6 6 1 1 1 1 1 1 1
symmnumber: 1
zpe: 370324.8 jmol-1
zpe.correction: 0.141049 hartree
zpe.thermalcorrener: 0.152802 hartree
zpe.thermalcorrenthalpy: 0.153746 hartree
zpe.thermalcorrgfe: 0.101873 hartree
zpe.sumelectzpe: -663.676874 hartree
zpe.sumelectthermal: -663.665121 hartree
zpe.sumelectthermalent: -663.664177 hartree
zpe.sumelectthermalfe: -663.716050 hartree
dipole: -4.8864 -1.4011 -0.0020
dipole: 5.0833
quadrupole: -84.8040 -73.5641 -74.2167
quadrupole: 9.6586 -0.0219 -0.0027
quadrupole: -7.2757 3.9641 3.3116 9.6586 -0.0219 -0.0027
hfenergy: -663.8179234 hartree
pointgroup: C01 [X(C8H7N1O4)]
dipole: -1.9129533 -0.58335 -0.0020518 debye
dipolederiv: -1.2684913 -0.3630685 0.0006773 -0.6932474 -0.854564 0.0000336 0.0025533 0.0015621 -0.2921164 -0.8383825 0.253679 -0.000957 0.0280823 -0.8191985 0.0014695 0.0001184 -0.0014456 -0.3184665 -0.764002 -0.195184 -0.0007398 -0.1721638 -0.6351912 -0.0003614 -0.0008746 -0.0004586 -0.2239176 -0.7157788 0.1962344 -0.0005171 0.1841041 -0.6813321 0.0000171 -0.0006231 0.0000884 -0.2245086 1.8121218 -0.0342919 0.0019808 -0.0488419 1.094835 0.0002943 0.0022477 0.0003268 0.1926952 -0.4178908 0.011596 0.0000309 0.0053095 0.0475063 0.0000751 -0.0009111 -0.0000279 0.0130212 -0.6210107 0.0392799 -0.0007455 0.0466867 0.1154723 0.0001233 -0.0010041 0.0001229 0.0672321 -0.1342859 -0.2063059 0.0000067 -0.0203289 0.0285961 -0.000052 -0.0008563 -0.0001818 -0.1019991 -0.0844283 0.2079336 0.0002814 0.0578386 -0.0198785 0.0001285 -0.0007687 0.0004035 -0.1037746 0.0624194 0.1850079 0.0003122 -0.1089582 -0.0665858 -0.0000487 0.0003395 0.0003463 -0.1053774 0.0413939 -0.1929772 0.000057 0.088466 -0.0515462 0.0001255 0.0003331 -0.0003406 -0.1060229 1.8429425 0.0339256 0.0007575 0.5335036 1.3358093 -0.0015207 0.0007302 -0.0000056 0.2426395 0.7350874 0.1658885 -0.0006004 0.1205935 0.2564283 0.0000243 -0.0010108 -0.000375 0.2780836 0.1030137 0.0602293 -0.0000855 0.0371734 0.033146 -0.0000074 -0.0001203 -0.0000081 0.1549107 0.0944804 -0.0527864 -0.0001924 -0.0646555 0.0341756 -0.0001349 -0.0002209 -0.0001193 0.1552602 0.0929483 -0.0589447 -0.000114 -0.0272754 0.0749721 -0.0001193 0.0000039 -0.0001994 0.1732224 0.1037407 0.0538974 -0.0000292 0.0257961 0.0603652 -0.0000289 0.000077 0.0000654 0.1720368 0.0359019 -0.0358009 0.0001376 -0.1057826 -0.0856702 0.000442 0.0003291 0.0004291 0.1244656 -0.040148 -0.0340288 -0.0214935 0.0569794 0.0665921 0.0963287 -0.063972 0.0620271 -0.0488201 -0.0396316 -0.0342834 0.0212331 0.0567203 0.0660682 -0.0967886 0.0636299 -0.0622099 -0.0485644 unknown
polarizability: 178.066385|1.3203109|114.5576239|0.1035295|0.0259218|46.3351083 unknown
InChI: InChI=1S/C8H7NO4/c1-13-8(10)6-2-4-7(5-3-6)9(11)12/h2-5H,1H3
charge 0 multiplicity 1
20 atoms
O  -3.132167 -0.919239 -0.002365
O  -3.092723 1.41097 -0.001848
O  3.954579 0.980985 0.004322
O  3.805555 -1.294947 0.003146
N  3.277498 -0.117422 0.00287
C  -0.994827 0.161781 -0.003052
C  1.792777 -0.01979 0.000814
C  -0.208596 1.343234 -0.001165
C  -0.370837 -1.11282 -0.00284
C  1.195323 1.260065 0.000724
C  1.033133 -1.210199 -0.000955
C  -2.483097 0.314432 -0.005332
C  -4.614106 -0.862052 0.000481
H  -0.717764 2.311825 -0.001368
H  -0.992155 -2.011599 -0.004296
H  1.828613 2.150576 0.002118
H  1.545995 -2.175134 -0.000801
H  -4.934813 -1.912604 0.002749
H  -4.975224 -0.335482 -0.898562
H  -4.971762 -0.33268 0.89926
