program: Gaussian 09
title: 000130277
version: EM64L-G09RevD.01
frameworkgroup: C1[X(C20H28O4)]
method: RPBEPBE
basis: SDD
operation: Freq
keyword: #pfreq=noraman
keyword: PBEPBE/SDD
title: #p freq=noraman PBEPBE/SDD
converged: YES YES NO NO
title: Mulliken charges:
elementType: O O O O C C C C C C C C C C C C C C C C C C C C H H H H H H H H H H H H H H H H H H H H H H H H H H H H
charge: -0.324142 -0.273075 -0.201127 -0.246084 0.253881 0.384141 -0.116918 -0.124951 -0.138055 0.364748 -0.557815 -0.508820 -0.533004 -0.555075 -0.520969 -0.626012 -0.556661 -0.100919 -0.458443 -0.515770 0.154227 -0.817389 0.273687 -0.762082 0.212700 0.266747 0.213422 0.224204 0.232087 0.224462 0.215641 0.241861 0.199319 0.223313 0.230016 0.198079 0.221050 0.255863 0.247202 0.212293 0.231757 0.259297 0.223992 0.237436 0.242557 0.257132 0.242235 0.228090 0.226879 0.246684 0.246418 0.245887
chargesum: 0.00000
title: Mulliken charges with hydrogens summed into heavy atoms:
elementType: O O O O C C C C C C C C C C C C C C C C C C C C
charge: -0.324142 -0.273075 -0.201127 -0.246084 0.253881 0.384141 0.095782 0.141796 0.075368 0.364748 -0.101524 -0.068717 -0.091824 -0.101745 -0.101841 -0.122947 -0.112610 0.158379 0.002985 -0.016081 0.154227 -0.120184 0.273687 -0.023093
polarizability: 2.75151343e+02 6.78665266e+00 1.99903190e+02 -5.76389615e-01 -2.22776686e+00 1.65432923e+02
1716.lowfreq: 0.0005 0.0006 0.0010 2.2331 3.7796 8.5784 24.3894 31.4819 44.1808
frequency: 24.3007 31.3887 44.1388 46.3059 50.6865 74.5382 91.8093 120.6295 139.2588 155.9890 162.8112 180.2567 188.2516 207.3683 211.1763 242.0600 263.1302 268.2241 291.2767 304.9485 322.0519 347.3497 362.6307 368.4789 399.1664 403.3374 427.9653 444.2744 464.5313 493.0975 499.4275 508.0100 538.6888 547.8040 565.7241 572.9355 583.1417 601.5830 636.2852 650.2386 666.2673 719.5664 736.9886 772.0019 779.2756 817.6931 821.1871 833.5942 842.7545 846.8116 865.4210 895.2012 901.6862 925.1517 947.8156 960.1948 969.7353 981.0524 996.4892 998.9282 1007.2304 1018.3794 1021.6612 1030.8952 1040.6784 1042.1794 1053.3078 1069.1687 1082.8003 1087.4662 1105.4038 1119.5995 1130.3021 1141.7898 1153.4753 1168.4100 1175.4378 1187.5385 1191.5003 1200.6894 1205.6534 1212.2061 1213.6404 1226.9280 1241.6384 1244.2923 1255.6720 1260.2377 1263.6974 1277.9425 1286.6326 1296.9426 1306.0047 1307.3836 1316.1138 1319.6251 1327.8191 1333.8989 1341.6654 1344.2265 1346.7230 1355.8838 1364.1565 1375.7928 1381.8894 1396.7235 1400.9273 1417.2490 1424.6288 1453.2742 1455.5747 1456.3034 1459.6149 1464.4300 1468.1730 1469.4468 1474.8192 1481.9601 1491.2524 1493.4607 1626.9850 1646.3765 2904.3937 2916.9890 2959.8449 2960.5153 2976.7899 2980.8350 2983.6273 2987.3293 2993.1756 2994.9981 2996.2957 2999.1871 3007.0453 3007.4387 3020.1818 3026.4348 3026.6139 3030.6823 3043.1600 3044.7108 3052.1577 3053.6023 3078.4503 3086.0681 3090.5894 3094.5326 3095.6565 3142.5039
redmass: 8.0914 6.8062 2.3699 4.0131 1.6680 2.0450 3.2531 3.3214 2.2827 2.9827 2.0354 2.4343 2.9041 1.5315 3.3576 3.4439 2.3847 2.5381 3.4467 2.6999 3.7179 5.0787 2.4791 2.9437 3.4613 3.7925 3.2794 2.5977 3.4806 2.9420 3.3431 3.4147 3.1029 3.4013 3.1287 2.9526 2.8736 4.0737 4.6289 3.1197 3.2505 2.6970 2.3699 3.7274 3.0815 2.1062 2.2624 1.9769 2.1942 2.1055 2.9966 2.2754 1.8570 2.4127 2.0235 2.1138 2.6887 2.2355 2.0087 2.1355 2.0797 2.2466 1.9580 2.0683 1.6709 2.7561 2.3820 2.4214 1.8651 2.6091 1.8742 2.2950 1.9498 1.4561 1.7337 2.1414 1.5444 2.1569 1.5686 1.8297 2.0489 1.3622 1.6147 1.5845 1.3992 1.4357 1.6787 1.4374 1.6546 1.3628 1.4276 1.4245 1.5889 1.4591 1.3871 1.6738 1.4427 1.3560 1.5539 1.4409 1.5006 1.5814 1.7061 1.5490 1.2554 1.2090 1.5117 1.3352 1.3233 1.0641 1.0475 1.0870 1.0966 1.1371 1.0902 1.0852 1.0818 1.0784 1.0674 1.0706 10.4951 9.2892 1.0811 1.0798 1.0623 1.0645 1.0611 1.0648 1.0615 1.0610 1.0743 1.0600 1.0617 1.0450 1.0729 1.0483 1.0633 1.0976 1.0970 1.0963 1.1020 1.1014 1.0955 1.1022 1.0986 1.1000 1.1010 1.0991 1.0974 1.1010
irintensity: 4.0195 1.6321 2.1777 4.0967 0.7243 0.4065 0.4154 1.6912 1.5008 1.6226 2.3733 3.7119 0.2602 0.5503 0.5966 7.4026 0.6325 0.2602 3.1849 4.9260 1.2047 0.7667 1.2406 2.2118 12.4368 2.3468 0.8276 0.8701 4.9129 1.0942 2.8433 0.3251 2.8679 6.2566 2.0922 5.4522 1.4156 7.9089 17.6014 3.3900 2.1065 2.2790 1.3342 8.6675 1.5150 0.5154 0.3922 4.2592 11.5607 2.7643 15.8041 12.4426 12.0766 4.3568 10.7719 22.5366 9.6590 7.1630 5.6363 153.6289 44.3196 0.5251 3.3079 25.1015 8.5677 7.2871 5.7440 3.6036 1.3815 0.7081 5.7756 5.0751 2.4681 1.6780 10.2012 9.0374 6.1680 47.0842 2.3325 132.9061 124.6512 22.3702 135.2692 9.2907 14.5457 7.6768 11.4315 8.1948 3.8890 1.9171 1.9529 0.6315 10.8577 1.6853 1.1452 1.0018 1.7282 1.0479 6.3089 3.0827 0.1910 6.0112 4.0660 0.3887 53.7741 30.8875 12.0534 8.1846 15.3003 25.2446 16.7339 13.7489 7.1010 4.5504 8.0960 5.6498 12.0231 1.7471 8.4378 10.3853 204.2158 188.9954 12.6279 20.6690 32.7131 29.6904 0.9722 30.2402 38.1718 29.7133 6.1106 26.9362 10.7323 30.5383 5.9633 7.8819 32.0503 13.3998 26.3454 22.1824 1.6608 94.4152 24.0273 18.3046 15.9541 41.7867 17.5378 28.3302 8.5627 12.4572
temp: 298.150 k
press: 1.00000 atm
elementType: 8 8 8 8 6 6 6 6 6 6 6 6 6 6 6 6 6 6 6 6 6 6 6 6 1 1 1 1 1 1 1 1 1 1 1 1 1 1 1 1 1 1 1 1 1 1 1 1 1 1 1 1
symmnumber: 1
zpe: 1161470.3 jmol-1
zpe.correction: 0.442381 hartree
zpe.thermalcorrener: 0.465280 hartree
zpe.thermalcorrenthalpy: 0.466224 hartree
zpe.thermalcorrgfe: 0.389768 hartree
zpe.sumelectzpe: -1077.970782 hartree
zpe.sumelectthermal: -1077.947882 hartree
zpe.sumelectthermalent: -1077.946938 hartree
zpe.sumelectthermalfe: -1078.023394 hartree
dipole: -2.4979 0.3264 0.2472
dipole: 2.5313
quadrupole: -186.2407 -133.8493 -148.1029
quadrupole: 10.1984 -13.6231 0.7392
quadrupole: -30.1764 22.2150 7.9614 10.1984 -13.6231 0.7392
hfenergy: -1078.4131623 hartree
pointgroup: C01 [X(C20H28O4)]
dipole: -0.9851638 -0.1160376 -0.088047 debye
polarizability: 275.0020099|-7.5521846|200.140562|-1.0418078|-1.1798805|165.3448848 unknown
InChI: InChI=1S/C20H28O4/c1-12(21)23-17-4-3-15-14-6-9-19-11-13(22)5-10-20(19,24-19)16(14)7-8-18(15,17)2/h14-17H,3-11H2,1-2H3
charge 0 multiplicity 1
52 atoms
O  2.770401 0.168235 -1.412421
O  -4.448223 0.639642 -0.312883
O  6.695027 0.576721 0.32201
O  -5.848773 0.18305 1.499408
C  2.442131 0.478493 0.04538
C  3.227015 -0.766966 -0.289148
C  0.954297 0.373503 0.403331
C  0.317028 -0.937301 -0.160022
C  -1.154464 -0.984906 0.286069
C  -1.976965 0.233665 -0.251696
C  2.555559 -2.143559 -0.324682
C  1.141027 -2.158293 0.299852
C  0.150409 1.638224 -0.021293
C  3.216797 1.671019 0.610103
C  -1.361292 1.532175 0.317907
C  4.736602 -0.797568 -0.076215
C  -2.031979 -2.21874 -0.064086
C  -3.360727 -0.157151 0.324176
C  -3.502634 -1.686179 0.054655
C  4.621561 1.812967 -0.018506
C  5.455581 0.54728 0.09739
C  -2.044205 0.295847 -1.800971
C  -5.653103 0.73455 0.392285
C  -6.644242 1.585888 -0.37291
H  0.904377 0.301197 1.515571
H  0.364669 -0.896623 -1.267133
H  -1.156727 -0.895572 1.398436
H  3.202617 -2.881548 0.186821
H  2.497397 -2.453986 -1.386333
H  0.628399 -3.096959 0.016874
H  1.214873 -2.153931 1.407655
H  0.291222 1.804221 -1.106567
H  0.554666 2.533161 0.488569
H  3.29446 1.551916 1.710092
H  2.659221 2.6075 0.430079
H  -1.48547 1.538606 1.421506
H  -1.893157 2.421503 -0.072244
H  5.219853 -1.32758 -0.922333
H  4.972818 -1.404267 0.821092
H  -1.845445 -3.066008 0.618708
H  -1.820331 -2.574588 -1.09002
H  -3.401978 0.044496 1.412266
H  -4.06292 -1.841331 -0.885076
H  -4.070606 -2.176412 0.86233
H  5.186225 2.652006 0.423195
H  4.493917 2.014422 -1.100709
H  -2.748007 1.08884 -2.106653
H  -1.060881 0.519421 -2.247012
H  -2.401626 -0.651632 -2.240744
H  -6.824089 1.153886 -1.372536
H  -6.236962 2.600835 -0.523186
H  -7.590643 1.64463 0.183321
