program: Gaussian 09
title: 000130233
version: EM64L-G09RevD.01
frameworkgroup: C1[X(C18H20O2)]
method: RPBEPBE
basis: SDD
operation: Freq
keyword: #pfreq=noraman
keyword: PBEPBE/SDD
title: #p freq=noraman PBEPBE/SDD
converged: YES YES NO NO
title: Mulliken charges:
elementType: O O C C C C C C C C C C C C C C C C C C H H H H H H H H H H H H H H H H H H H H
charge: -0.372830 -0.188837 0.174666 -0.442331 0.351731 -0.464385 0.082256 -0.518659 -0.741870 -0.736589 0.280949 -0.423054 0.475513 -0.551077 -0.656562 -0.592642 0.145546 0.250664 0.096709 -0.802652 0.203699 0.202001 0.209932 0.210179 0.217990 0.222230 0.223859 0.215439 0.227015 0.211541 0.225869 0.214985 0.231036 0.241578 0.231834 0.259650 0.350844 0.235455 0.235305 0.263012
chargesum: 0.00000
title: Mulliken charges with hydrogens summed into heavy atoms:
elementType: O O C C C C C C C C C C C C C C C C C C
charge: -0.021986 -0.188837 0.174666 -0.036631 0.351731 -0.044274 0.082256 -0.078439 -0.075557 -0.084194 0.280949 -0.192019 0.475513 -0.309499 -0.424728 -0.332992 0.145546 0.250664 0.096709 -0.068880
polarizability: 3.31389949e+02 1.32853068e+01 2.08975820e+02 -4.79421795e-02 -2.17944948e+00 1.13457387e+02
1716.lowfreq: -16.9135 -5.8361 0.0005 0.0005 0.0007 5.8788 12.4794 44.0084 50.2668
frequency: -16.4898 43.9842 50.1068 96.2678 129.3332 132.0635 181.0235 190.0724 206.1907 218.5277 231.9153 246.5066 258.2046 270.4693 298.4756 317.3941 327.3104 353.2284 380.0335 399.3410 418.2505 420.7482 424.7555 450.6141 456.3484 498.2966 503.1279 527.4482 540.1736 566.9321 607.9826 623.4440 652.4802 685.7433 724.5480 735.8910 760.0815 783.0978 806.6166 819.0371 838.8778 865.8437 871.8172 900.1866 917.6919 927.1282 928.3703 950.0843 965.7986 969.8864 996.2809 1022.2856 1025.5779 1036.6074 1059.3530 1099.6292 1121.1345 1125.7405 1140.8664 1173.7353 1200.3307 1204.5802 1213.1757 1217.2625 1234.8247 1261.2080 1275.6360 1285.9546 1302.0730 1315.8569 1339.9271 1341.2281 1357.7996 1365.9367 1375.0696 1392.0841 1396.5790 1416.8085 1431.1174 1451.8721 1455.1763 1458.6131 1465.2208 1468.9767 1469.0989 1473.0512 1479.0835 1483.8260 1491.5239 1515.3450 1568.7112 1591.8591 1605.1831 1629.8034 2948.5172 2967.3153 2973.7370 2977.4220 2984.9357 2988.2813 3010.7855 3029.8254 3047.8604 3065.6373 3071.6119 3071.9994 3078.9957 3082.8049 3121.9338 3122.8820 3123.2325 3149.3489 3152.3683 3528.2282
redmass: 5.5089 4.2820 3.6959 2.9286 3.9988 4.7143 2.6938 1.0404 1.4772 4.1103 2.8485 1.4040 1.6207 2.3721 3.8695 3.6162 3.2815 2.1915 4.1177 3.4082 1.5862 2.0996 4.5060 3.1943 3.4332 3.4192 3.1024 2.9955 3.9296 3.4101 3.0177 4.0071 3.4590 6.1575 3.6494 4.0963 5.2801 2.6587 2.4413 1.4451 1.7238 2.1466 2.5832 2.1838 1.5606 2.7670 1.5157 2.0902 1.9543 1.4781 1.3301 1.8224 2.0612 1.7770 2.3282 1.8107 1.5438 1.8094 2.1678 1.8387 1.6926 1.8984 2.0680 1.7772 1.7068 2.2366 1.5571 2.4228 2.3512 1.6735 1.5318 1.8145 1.6178 1.2533 1.1844 2.2589 1.6221 4.9990 5.6099 1.2565 1.1215 1.1677 1.0805 1.5157 1.0505 1.0834 1.0774 1.0985 1.1322 3.5660 7.4793 6.7470 7.3756 6.9531 1.0641 1.0598 1.0351 1.0372 1.0372 1.0655 1.0918 1.0982 1.1030 1.0994 1.0988 1.0976 1.0998 1.0991 1.0868 1.0918 1.0965 1.0957 1.0905 1.0654
irintensity: 6.7253 0.0180 0.0242 0.0430 0.3952 1.1374 0.9263 0.6322 0.5823 2.3438 0.6313 0.8665 0.5280 0.5301 2.9164 0.7505 3.8282 3.2598 4.1842 8.9632 67.1729 50.9573 4.3767 2.1426 0.6905 9.8398 5.1818 6.7311 8.2503 0.4286 3.9926 26.7036 5.5264 1.8195 0.6251 2.6966 11.5582 1.7950 4.1479 16.0525 29.6385 9.4385 2.6348 0.6343 25.0465 35.3972 1.6074 24.7247 9.9529 6.0344 2.5466 1.7982 7.4178 2.5432 26.6841 3.8839 10.9905 225.1205 25.3580 6.7996 1.3807 13.4078 2.4142 183.6336 13.2906 13.0358 28.8077 43.0146 26.3198 11.2875 11.6450 4.4270 1.8889 55.9526 19.1672 5.8045 8.8648 27.3977 5.0611 12.1384 5.2291 5.8706 2.3529 36.3812 19.1837 5.4733 19.5540 18.1904 24.6610 22.8280 27.6976 90.6723 183.5033 182.4596 21.8091 29.9248 28.6087 54.4985 4.9434 26.9916 32.1994 60.8613 51.6526 7.2217 92.3461 15.0956 23.6607 38.3446 4.5671 16.2725 20.0513 22.8347 10.0164 26.9262
temp: 298.150 k
press: 1.00000 atm
elementType: 8 8 6 6 6 6 6 6 6 6 6 6 6 6 6 6 6 6 6 6 1 1 1 1 1 1 1 1 1 1 1 1 1 1 1 1 1 1 1 1
symmnumber: 1
zpe: 869119.8 jmol-1
zpe.correction: 0.331030 hartree
zpe.thermalcorrener: 0.348612 hartree
zpe.thermalcorrenthalpy: 0.349557 hartree
zpe.thermalcorrgfe: 0.287105 hartree
zpe.sumelectzpe: -846.923814 hartree
zpe.sumelectthermal: -846.906232 hartree
zpe.sumelectthermalent: -846.905287 hartree
zpe.sumelectthermalfe: -846.967739 hartree
dipole: -5.4812 -0.7179 -0.0020
dipole: 5.5280
quadrupole: -140.1072 -102.3043 -121.9099
quadrupole: -11.9114 0.6007 -0.8828
quadrupole: -18.6668 19.1362 -0.4694 -11.9114 0.6007 -0.8828
hfenergy: -847.2548441 hartree
pointgroup: C01 [X(C18H20O2)]
dipole: -2.1579803 -0.2704325 0.0093023 debye
polarizability: 331.5297911|12.5921488|208.7898371|-0.9583738|-3.0052377|113.5035272 unknown
InChI: InChI=1S/C18H20O2/c1-11(19)14-9-12-6-7-16-13(15(12)10-17(14)20)5-4-8-18(16,2)3/h6-7,9-10,20H,4-5,8H2,1-3H3
charge 0 multiplicity 1
40 atoms
O  3.330086 2.299721 -0.141402
O  5.340348 0.492248 -0.04629
C  -3.732403 -0.39008 -0.060229
C  -4.152146 1.068003 -0.40674
C  -2.192537 -0.525375 -0.005813
C  -3.338268 2.114513 0.371472
C  -1.322425 0.585211 -0.010293
C  -1.849755 2.01718 -0.014858
C  -4.330877 -0.80054 1.320208
C  -4.326079 -1.323031 -1.157281
C  0.110733 0.370314 -0.010859
C  -1.639377 -1.853237 0.064657
C  0.641596 -0.973868 0.04437
C  -0.269344 -2.078079 0.094602
C  1.054258 1.443234 -0.072998
C  2.052516 -1.170062 0.047458
C  2.439556 1.224967 -0.074258
C  2.983569 -0.116459 -0.008267
C  4.457289 -0.41057 -0.00013
C  4.894692 -1.881012 0.066989
H  -5.235196 1.182353 -0.206525
H  -4.006016 1.238268 -1.493427
H  -3.453167 1.952102 1.46062
H  -3.71291 3.133514 0.159317
H  -1.252324 2.635371 0.683204
H  -1.701337 2.460855 -1.022842
H  -4.018647 -1.82217 1.602612
H  -5.436215 -0.780556 1.277039
H  -4.002307 -0.118662 2.124597
H  -4.208747 -2.393089 -0.910664
H  -3.845439 -1.142283 -2.135888
H  -5.409593 -1.125491 -1.263478
H  -2.321135 -2.709622 0.092678
H  0.128231 -3.098424 0.149108
H  0.693025 2.477056 -0.133554
H  2.416959 -2.201154 0.094245
H  2.824999 3.15318 -0.18169
H  4.521866 -2.457323 -0.799972
H  4.5268 -2.374904 0.985375
H  5.994821 -1.9068 0.065005
