program: Gaussian 09
title: 000130232
version: EM64L-G09RevD.01
frameworkgroup: C1[X(C18H9NO)]
method: RPBEPBE
basis: SDD
operation: Freq
keyword: #p
keyword: freq=noraman
keyword: PBEPBE/SDD
title: #p freq=noraman PBEPBE/SDD
converged: YES YES NO NO
title: Mulliken charges:
elementType: O N C C C C C C C C C C C C C C C C C C H H H H H H H H H
charge: -0.195208 0.006432 0.035097 -0.017563 0.372852 0.477510 0.491940 0.467989 0.173065 -0.365187 -0.548204 -0.481482 -0.473359 -0.486658 -0.454460 -0.452887 -0.393359 -0.239684 0.082191 -0.246556 0.243689 0.245889 0.247174 0.244950 0.249586 0.251695 0.247418 0.281585 0.235545
chargesum: 0.00000
title: Mulliken charges with hydrogens summed into heavy atoms:
elementType: O N C C C C C C C C C C C C C C C C C C
charge: -0.195208 0.006432 0.035097 -0.017563 0.372852 0.477510 0.491940 0.467989 0.173065 -0.121499 -0.302315 -0.234308 -0.228409 -0.237072 -0.202765 -0.205469 -0.111774 -0.004139 0.082191 -0.246556
polarizability: 3.80893299e+02 -1.58440885e+01 2.50091328e+02 2.30258165e-01 2.03657798e-02 7.48130819e+01
1716.lowfreq: -8.4117 -7.5145 -0.0009 -0.0007 0.0005 5.4794 15.6134 56.9800 108.1829
frequency: 15.3368 56.9795 108.1829 137.7012 173.2123 208.5996 209.2296 252.4249 269.2477 316.8987 320.6882 349.2028 410.4529 410.8678 441.4101 477.4816 494.4545 505.3459 505.7096 538.3834 547.8599 567.8176 590.7753 612.6432 663.4003 690.1242 696.2567 721.8102 754.3315 761.5389 774.6406 808.7570 826.7020 837.9260 854.5318 869.0279 889.1911 926.6422 969.7159 982.0387 982.9865 992.2983 999.4040 1010.5929 1063.2253 1107.1572 1117.7108 1159.8997 1182.5477 1193.6783 1210.4195 1232.4179 1250.5509 1253.0491 1262.5798 1341.2227 1370.9324 1390.8598 1407.3351 1423.9568 1432.2568 1439.8854 1471.4844 1480.9431 1495.8471 1512.9276 1541.6313 1589.9610 1601.5961 1612.3380 1633.1346 2150.3688 3126.6452 3129.0477 3136.0268 3137.6452 3137.8052 3150.7271 3162.7488 3163.7596 3207.6526
redmass: 9.2844 7.3129 4.6706 10.7358 4.6754 5.9603 5.1913 5.6519 4.6822 10.4003 6.2189 8.2813 4.2802 5.0935 6.0387 6.6346 3.6746 4.4857 4.8712 5.3928 3.0855 6.9183 3.9708 8.9047 8.5441 7.0079 3.9584 3.6744 2.7615 5.6248 1.3248 4.8298 1.3519 6.8526 4.3582 2.0306 1.6130 1.4575 4.7036 1.3446 8.9216 1.3939 1.4111 1.3927 2.9003 2.1659 2.3520 1.3599 1.3209 1.3306 1.3688 1.9107 3.4837 1.7033 2.0409 3.1293 3.7714 4.2188 2.4070 3.5843 3.7438 2.5893 5.4334 6.1820 5.3323 4.0602 5.3969 5.9272 6.9380 6.5515 7.3175 12.6887 1.0868 1.0867 1.0917 1.0902 1.0899 1.0983 1.0990 1.0957 1.0917
irintensity: 0.1724 0.8755 1.0294 1.9652 0.3253 6.2173 7.6890 4.6800 1.9357 0.0510 1.9521 19.7659 0.4952 0.8454 3.4305 1.8190 0.6739 1.4857 1.6526 1.3087 0.1279 1.3614 0.6575 1.5155 0.2525 0.0322 0.0997 46.2332 0.7477 0.0177 9.0042 3.0299 1.2690 3.4683 4.3513 26.3684 120.9122 1.4363 9.2897 1.0226 32.4259 0.0203 2.5306 0.0994 19.2888 13.8310 2.1368 1.8560 0.8069 1.4933 25.1947 36.6722 251.9069 0.9573 53.1873 36.2886 5.2507 11.0972 6.9347 32.9402 1.1816 4.5136 49.3995 438.3785 142.5945 0.2570 54.4997 35.5734 35.0501 40.1468 28.4351 8.5836 0.7441 0.2676 0.4430 19.6312 4.8440 26.7717 35.7205 7.6689 3.2689
temp: 298.150 k
press: 1.00000 atm
elementType: 8 7 6 6 6 6 6 6 6 6 6 6 6 6 6 6 6 6 6 6 1 1 1 1 1 1 1 1 1
symmnumber: 1
zpe: 555155.8 jmol-1
zpe.correction: 0.211448 hartree
zpe.thermalcorrener: 0.225555 hartree
zpe.thermalcorrenthalpy: 0.226499 hartree
zpe.thermalcorrgfe: 0.169566 hartree
zpe.sumelectzpe: -820.007315 hartree
zpe.sumelectthermal: -819.993208 hartree
zpe.sumelectthermalent: -819.992263 hartree
zpe.sumelectthermalfe: -820.049197 hartree
dipole: 7.4338 1.7750 -0.0161
dipole: 7.6428
quadrupole: -126.4002 -102.0416 -118.5325
quadrupole: -7.3328 0.0895 0.3080
quadrupole: -10.7421 13.6165 -2.8744 -7.3328 0.0895 0.3080
hfenergy: -820.2187629 hartree
pointgroup: C01 [X(C18H9N1O1)]
dipole: 2.9122931 0.7419539 -0.0979578 debye
polarizability: 380.7758242|-13.5513087|249.348578|-13.1484069|7.7499755|75.6733077 unknown
InChI: InChI=1S/C18H9NO/c19-10-16(20)14-8-6-13-5-4-11-2-1-3-12-7-9-15(14)18(13)17(11)12/h1-9H
charge 0 multiplicity 1
29 atoms
O  -4.555379 0.711356 0.209846
N  -4.181353 -2.609188 0.125472
C  0.348358 0.532354 0.02023
C  1.611791 -0.154033 -0.060528
C  -0.898509 -0.21256 0.036514
C  0.343923 1.974957 0.084234
C  1.655501 -1.591554 -0.12793
C  2.850157 0.58807 -0.075267
C  -2.138894 0.527084 0.119653
C  -0.809017 -1.655407 -0.035267
C  0.407735 -2.311104 -0.113173
C  1.593352 2.696486 0.067961
C  2.803492 2.029612 -0.008507
C  -0.90013 2.663239 0.16211
C  2.909979 -2.256432 -0.206946
C  4.084895 -0.112783 -0.154963
C  -2.100617 1.954564 0.178684
C  4.113518 -1.521751 -0.220175
C  -3.516442 -0.026713 0.154513
C  -3.790022 -1.478954 0.133002
H  -1.717208 -2.257507 -0.028897
H  0.431106 -3.405658 -0.165422
H  1.561895 3.790658 0.117606
H  3.747303 2.586967 -0.020209
H  -0.904918 3.757613 0.209767
H  2.931662 -3.351016 -0.257565
H  5.021203 0.457089 -0.165509
H  -3.059563 2.478709 0.23936
H  5.07278 -2.0459 -0.281395
