program: Gaussian 09
title: 000130202
version: EM64L-G09RevD.01
frameworkgroup: C1[X(C12H8N2O3)]
method: RPBEPBE
basis: SDD
operation: Freq
keyword: #p
keyword: freq=noraman
keyword: PBEPBE/SDD
title: #p freq=noraman PBEPBE/SDD
converged: YES YES NO NO
title: Mulliken charges:
elementType: O O O N N C C C C C C C C C C C C H H H H H H H H
charge: -0.251547 -0.187923 -0.257374 -0.439721 -0.017482 0.352857 0.078730 0.216639 -0.437943 0.020463 0.249891 -0.371585 -0.332241 -0.258295 -0.164825 -0.260720 -0.155221 0.358921 0.261941 0.260505 0.283891 0.258664 0.266319 0.258850 0.267204
chargesum: 0.00000
title: Mulliken charges with hydrogens summed into heavy atoms:
elementType: O O O N N C C C C C C C C C C C C
charge: -0.251547 -0.187923 -0.257374 -0.080799 -0.017482 0.352857 0.078730 0.216639 -0.176002 0.020463 0.249891 -0.111079 -0.048350 0.000369 0.101494 -0.001870 0.111983
polarizability: 3.56218790e+02 2.22472706e+00 1.52058752e+02 -2.76228532e-02 -7.68061257e-03 5.96589252e+01
1716.lowfreq: -3.1986 -0.5263 -0.0007 -0.0003 0.0007 5.1039 28.9260 44.2895 56.9344
frequency: 28.8745 44.2874 56.8988 62.7225 114.4089 117.7877 176.6612 209.7473 220.1695 274.1263 340.5142 394.7812 422.5108 473.6135 579.0400 582.6194 584.1441 588.8851 628.2206 664.4511 682.1958 724.7661 756.4388 762.8602 792.6077 812.7783 828.2432 836.3746 844.6347 861.2655 869.6369 870.5885 881.1955 905.4989 906.2295 947.2309 988.1667 1006.5690 1015.2750 1047.2034 1055.6117 1076.4651 1132.6157 1136.3942 1170.1518 1183.4458 1200.0452 1210.3912 1277.3097 1297.0022 1339.1696 1342.5819 1370.8870 1382.1220 1426.2681 1453.1526 1477.1658 1494.7179 1512.8732 1559.6558 1637.0393 3222.9949 3225.9880 3227.7382 3237.9466 3244.0093 3265.5409 3272.0333 3560.4961
redmass: 6.3365 4.7307 5.1735 5.9923 5.9117 6.8182 6.8150 6.4393 6.6717 5.7934 7.0169 9.5143 8.3320 5.3001 4.2355 3.5097 9.3312 3.5698 4.6119 6.0181 3.3121 1.2691 1.2627 4.3660 1.2694 1.3529 7.6867 1.4610 1.3960 5.8214 6.3809 6.3593 1.3619 4.8121 1.4014 4.3928 2.6427 1.9864 1.6798 2.6646 2.8855 2.3002 1.6051 1.6864 2.3309 3.1849 1.8237 1.5920 2.7405 2.6843 3.5405 5.0365 2.7597 4.5300 7.4169 4.8671 5.0546 11.1240 4.5542 7.2314 8.5339 1.0924 1.0912 1.0979 1.0994 1.0990 1.1089 1.1079 1.0815
irintensity: 1.7651 3.1356 0.0087 1.8694 2.1284 1.3654 1.2424 3.2854 15.9379 4.1237 3.8371 0.9047 1.6061 15.2036 1.1176 5.5147 1.3703 11.7459 1.8244 2.5274 5.4527 78.9649 98.8832 19.5119 60.5800 27.2304 113.4599 59.3978 28.9058 10.5481 6.4979 2.0855 0.0000 10.3786 2.3045 21.3882 9.7398 2.8315 40.7170 28.7939 44.5977 13.2759 1.2501 1.2193 74.1034 53.7966 25.3736 4.3702 164.7032 1.6742 4.1421 28.4580 3.1259 6.6402 157.2036 168.2496 167.1232 157.4669 11.8999 286.3578 7.8380 9.1486 3.3509 4.4786 0.3284 0.9913 0.3852 0.2869 77.0785
temp: 298.150 k
press: 1.00000 atm
elementType: 8 8 8 7 7 6 6 6 6 6 6 6 6 6 6 6 6 1 1 1 1 1 1 1 1
symmnumber: 1
zpe: 465921.8 jmol-1
zpe.correction: 0.177460 hartree
zpe.thermalcorrener: 0.190914 hartree
zpe.thermalcorrenthalpy: 0.191858 hartree
zpe.thermalcorrgfe: 0.134950 hartree
zpe.sumelectzpe: -796.029982 hartree
zpe.sumelectthermal: -796.016528 hartree
zpe.sumelectthermalent: -796.015584 hartree
zpe.sumelectthermalfe: -796.072492 hartree
dipole: -1.9383 -0.9351 0.0031
dipole: 2.1520
quadrupole: -56.4668 -95.4117 -101.5427
quadrupole: -1.4490 0.0028 0.0005
quadrupole: 28.0069 -10.9379 -17.0689 -1.4490 0.0028 0.0005
hfenergy: -796.207442 hartree
pointgroup: C01 [X(C12H8N2O3)]
dipole: -0.7669484 -0.3579256 -0.0230127 debye
dipolederiv: -0.2711691 -0.2292418 -0.0145222 -0.1725943 -0.4842152 -0.02164 -0.0106562 -0.0220644 -0.1342454 -0.2805589 -0.2251811 -0.011983 -0.3553733 -0.3608696 -0.014844 -0.0206785 -0.0141384 -0.091397 -0.8307662 0.0924734 0.0019856 -0.3208359 -0.997137 -0.0374169 -0.0223537 -0.0346928 -0.3527623 0.3816711 0.1776864 0.0136231 0.0686414 -0.4858937 -0.0154449 0.0074875 -0.0146273 -0.2111765 0.1189817 0.1864174 0.0126354 0.417685 -0.114437 0.0076593 0.025068 0.0061619 -0.2097604 0.389335 0.0666309 0.005752 -0.7626998 0.0216387 -0.009947 -0.0413823 -0.0051419 0.1175979 -1.3017123 -0.4222896 -0.0318679 -0.8421964 -0.0910631 -0.0113484 -0.0542644 -0.0093972 0.0355085 0.0596259 -0.0013263 0.0003107 -0.0896884 0.2947969 0.0150221 -0.0051688 0.0154127 0.0334168 -0.6175091 -0.2093215 -0.0145267 0.4431813 0.255778 0.0269333 0.0228262 0.0234891 -0.1721596 2.788325 0.0774197 0.0201244 0.677555 1.0353347 0.0498056 0.0539847 0.0459034 0.2104899 -1.1746992 0.3348351 0.0104688 0.094863 0.1819562 0.0089044 0.0004483 0.0108737 -0.0059692 0.0790489 -0.0339665 -0.0004659 -0.1541265 0.015622 0.0110754 -0.0078651 0.0117808 -0.1889184 0.5368051 -0.183542 -0.005321 -0.0589949 0.0479712 0.0090657 0.0019382 0.0083332 -0.1398744 0.0095141 -0.0094042 0.0007412 0.3039167 -0.1000548 0.0073869 0.0194779 0.0056557 -0.196144 -0.2897821 0.1647141 0.009043 0.1682626 0.1732679 0.0189404 0.0090191 0.0187844 -0.1309806 -0.0544255 0.0183981 0.0014455 0.5007891 -0.2559874 0.0007174 0.024551 -0.0018962 -0.2131862 -0.232337 0.2242785 0.0101023 0.0337582 0.2601443 0.0171963 0.0017027 0.0179919 -0.0887808 0.277357 -0.0230435 -0.0015484 0.0667856 0.2515798 -0.004412 0.003346 -0.0048776 0.3357253 0.0495028 -0.0613781 -0.0042289 -0.0765114 0.0095026 -0.0099714 -0.0050416 -0.0099497 0.1761175 0.1434572 0.037826 0.0018466 0.0337593 -0.0105709 -0.0120781 0.0014706 -0.0120173 0.1980566 0.1607845 0.0236507 0.0011054 0.010723 0.0317713 -0.0077901 0.0000665 -0.0079564 0.1914354 -0.050059 -0.0231614 -0.0029284 -0.0297855 0.1262055 -0.0045653 -0.0032565 -0.0045072 0.2005382 0.0806086 0.0157894 0.0000345 0.0240588 0.0356874 -0.0109633 0.0001713 -0.0109194 0.2243728 -0.0557421 -0.0105713 -0.0017528 -0.0097772 0.1298504 -0.0035708 -0.0017139 -0.0035181 0.2021774 0.0837435 0.0123076 -0.0000734 0.0286047 0.0291218 -0.0087144 0.0008231 -0.0086828 0.2099185 unknown
polarizability: 356.232769|-0.3341884|151.7570835|1.7047011|5.0570696|59.9466142 unknown
InChI: InChI=1S/C12H8N2O3/c15-11(10-4-2-6-17-10)12-13-7-8(14-12)9-3-1-5-16-9/h1-7,14H
charge 0 multiplicity 1
25 atoms
O  -3.539694 1.063839 0.092623
O  3.317368 -1.140906 0.013959
O  1.478838 2.035956 0.16971
N  -0.763917 0.468233 0.0732
N  0.392973 -1.479879 -0.031888
C  -1.715264 -0.539667 0.009967
C  0.502121 -0.12042 0.046022
C  -3.134123 -0.292946 0.015353
C  -0.963795 -1.744459 -0.054411
C  1.675082 0.766557 0.101808
C  3.043802 0.24688 0.081727
C  -4.264239 -1.105195 -0.039021
C  4.251262 0.949281 0.121692
C  -5.417138 -0.236618 0.004477
C  -4.946746 1.064002 0.084058
C  5.312339 -0.018761 0.079577
C  4.705971 -1.269709 0.01445
H  -0.919035 1.477314 0.130918
H  -1.342188 -2.762677 -0.114705
H  -4.269469 -2.191322 -0.102661
H  4.334348 2.032422 0.175702
H  -6.461319 -0.541209 -0.020048
H  -5.417328 2.041277 0.138509
H  6.382385 0.177043 0.094131
H  5.082566 -2.288134 -0.033451
