program: Gaussian 09
title: 000130248
version: EM64L-G09RevD.01
frameworkgroup: C1[X(C17H21NO7)]
method: RPBEPBE
basis: SDD
operation: Freq
keyword: #p
keyword: freq=noraman
keyword: PBEPBE/SDD
title: #p freq=noraman PBEPBE/SDD
converged: YES YES NO NO
title: Mulliken charges:
elementType: O O O O O O O N C C C C C C C C C C C C C C C C C H H H H H H H H H H H H H H H H H H H H H
charge: -0.140138 -0.176785 -0.179545 -0.179651 -0.283332 -0.308942 -0.303214 -0.179589 0.042870 -0.394949 -0.395238 0.157336 0.183564 -0.700445 -0.698547 0.129200 0.391955 -0.457958 -0.536535 0.255668 0.271124 0.056150 -0.523177 -0.527843 -0.524230 0.229693 0.229282 0.228347 0.230057 0.225959 0.232733 0.238344 0.223289 0.238377 0.228207 0.268193 0.292670 0.234042 0.260886 0.217398 0.232357 0.235342 0.246649 0.231148 0.236555 0.262721
chargesum: 0.00000
title: Mulliken charges with hydrogens summed into heavy atoms:
elementType: O O O O O O O N C C C C C C C C C C C C C C C C C
charge: -0.140138 -0.176785 -0.179545 -0.179651 -0.283332 -0.308942 -0.303214 -0.179589 0.042870 0.064027 0.063166 0.157336 0.183564 -0.003411 -0.008674 0.129200 0.391955 -0.189765 -0.243864 0.255668 0.271124 0.056150 0.189149 0.186506 0.206194
polarizability: 3.12329481e+02 2.41631223e+00 2.19220710e+02 1.14727742e+01 7.36782894e+00 1.55897729e+02
1716.lowfreq: -5.6710 -0.0003 0.0003 0.0004 1.9186 4.8227 22.2218 24.1027 30.4107
frequency: 21.9467 24.0902 30.2531 44.9154 69.3617 78.4637 80.2848 83.6651 85.3213 95.3160 99.8679 124.3934 138.8190 152.0748 155.0594 157.1318 161.3716 167.7215 170.5671 187.5609 200.2790 204.9834 228.1254 255.2641 257.2228 271.8409 281.9909 290.7359 320.6064 333.7642 346.4280 367.2307 384.0433 414.1903 419.0520 459.0928 507.3949 519.2041 537.1462 565.1062 587.1114 621.9505 625.7386 645.7101 662.2235 679.4881 703.9471 723.2458 729.7012 773.5905 779.4775 781.3491 822.6363 865.5544 882.7879 895.8820 907.9172 920.9910 938.8271 945.9622 948.1815 986.2231 1026.0325 1036.2209 1046.7907 1058.9498 1080.1599 1083.6929 1092.3276 1110.2896 1111.7072 1113.1764 1134.7515 1150.5379 1155.5330 1159.5806 1160.5421 1187.8712 1193.5855 1205.3959 1217.9750 1257.5828 1301.4692 1302.7504 1310.7185 1349.8302 1363.7739 1396.0754 1403.5546 1405.2493 1414.5455 1433.2993 1437.5869 1447.3912 1453.2195 1458.1561 1459.6421 1459.8363 1462.8893 1476.5737 1478.1416 1480.1705 1483.4629 1483.6206 1485.6826 1486.6739 1561.4179 1601.4607 1610.0859 1648.5089 1731.6381 2975.9784 2978.1166 2984.2658 2985.8614 2986.7658 2997.3055 3001.3900 3053.4570 3058.0492 3073.6937 3082.0970 3085.1633 3085.6804 3085.6941 3086.6121 3090.2753 3124.8613 3130.7978 3131.2009 3176.1517 3185.1614
redmass: 4.4340 4.6069 4.5282 4.6219 3.3646 2.6787 2.4975 2.7855 4.0262 2.7918 6.5939 2.5963 3.0593 1.5575 1.5245 1.8252 2.1116 1.2329 3.8303 2.5983 2.5966 3.2414 4.1088 4.9293 1.2864 7.3949 2.0714 6.5985 4.6190 7.4018 4.9654 5.0941 6.2007 3.7313 5.8158 6.7653 5.7200 6.7837 8.1832 5.7690 5.6690 4.9723 7.0924 5.9065 5.1739 5.2323 5.1344 3.6135 4.8889 4.2391 1.3734 2.0719 3.9991 4.9128 1.8905 3.1392 2.3799 2.1854 8.4719 3.1844 2.5336 7.5888 3.4061 5.8355 1.5687 2.9190 1.3912 3.3398 4.2096 1.2632 1.2380 1.2402 2.9943 1.3518 1.5408 1.8799 3.2742 2.4898 3.0584 3.0498 1.5188 1.1474 6.7999 1.3630 1.3392 1.4402 6.8413 2.6371 1.2064 1.2097 1.3789 1.2577 1.4949 1.0809 1.5871 1.0565 1.0859 1.0867 1.3274 1.0588 1.0517 1.0511 1.0542 1.0411 1.0549 1.0391 7.9519 6.7526 12.2138 12.0778 12.1744 1.0302 1.0335 1.0366 1.0365 1.0295 1.0597 1.0593 1.1025 1.1020 1.1052 1.1009 1.1002 1.0996 1.0995 1.1008 1.1052 1.1027 1.1040 1.1043 1.0921 1.0924
irintensity: 0.3613 0.5694 0.9780 0.2596 0.5221 0.5974 0.1060 1.2074 2.0812 11.8710 7.6113 1.8361 0.4844 0.3223 1.2818 0.7053 4.5526 0.3571 3.0206 1.3323 2.2060 6.3987 5.1159 24.2334 0.1064 5.2913 2.4901 2.8508 3.9604 1.7977 8.0987 4.8041 6.4759 2.9780 0.7886 5.8403 6.7248 3.2393 13.2777 2.1788 14.5459 2.6548 13.1654 1.2571 1.4484 36.6302 4.6783 9.6787 44.3059 13.8180 12.0560 37.7205 67.1273 3.6804 10.7261 112.7878 18.1928 61.1355 78.7989 13.1826 37.2451 19.5756 34.4070 220.5182 20.0997 9.1645 0.1734 4.6178 5.5537 48.9692 5.7505 1.7076 113.2812 7.4323 64.8319 44.7934 267.8138 5.3369 178.2357 148.7334 19.3390 0.0433 470.4920 3.6701 6.3061 5.1224 22.0626 71.7100 16.9936 9.6692 9.6287 49.2978 24.6269 1.7184 52.9485 18.2145 22.6733 3.5251 13.1310 4.3014 11.3338 12.3851 16.0922 15.6363 30.0370 17.6680 110.7637 23.3378 151.4831 221.6161 245.3692 44.8960 92.5604 21.0012 11.6750 68.7878 2.1983 41.9765 0.1416 0.2133 25.2372 27.0318 55.4541 10.5393 31.6621 41.9050 17.8667 22.3136 17.5989 17.1166 2.7270 0.6247
temp: 298.150 k
press: 1.00000 atm
elementType: 8 8 8 8 8 8 8 7 6 6 6 6 6 6 6 6 6 6 6 6 6 6 6 6 6 1 1 1 1 1 1 1 1 1 1 1 1 1 1 1 1 1 1 1 1 1
symmnumber: 1
zpe: 933380.8 jmol-1
zpe.correction: 0.355506 hartree
zpe.thermalcorrener: 0.382839 hartree
zpe.thermalcorrenthalpy: 0.383783 hartree
zpe.thermalcorrgfe: 0.296357 hartree
zpe.sumelectzpe: -1239.754683 hartree
zpe.sumelectthermal: -1239.727350 hartree
zpe.sumelectthermalent: -1239.726406 hartree
zpe.sumelectthermalfe: -1239.813832 hartree
dipole: 3.2126 4.8303 4.1604
dipole: 7.1387
quadrupole: -130.6260 -146.9454 -149.3896
quadrupole: -3.4898 -9.6408 -9.5772
quadrupole: 11.6944 -4.6250 -7.0693 -3.4898 -9.6408 -9.5772
hfenergy: -1240.1101891 hartree
pointgroup: C01 [X(C17H21N1O7)]
dipole: -1.3285532 1.0108787 -2.2585915 debye
polarizability: 311.292578|10.1867343|205.0259288|14.2224097|-27.0088193|171.1294134 unknown
InChI: InChI=1S/C17H21NO7/c1-6-17(7-2)15(20)18(25-16(17)21)14(19)10-8-11(22-3)13(24-5)12(9-10)23-4/h8-9H,6-7H2,1-5H3
charge 0 multiplicity 1
46 atoms
O  2.950799 -0.312549 1.568239
O  1.328052 0.013164 -1.626754
O  5.181891 0.233994 1.280442
O  0.871077 -1.90828 2.165438
O  -3.961881 -2.513835 0.649474
O  -2.632099 2.034048 -0.804502
O  -4.689369 0.028541 -0.488241
N  1.755292 -0.306962 0.694538
C  3.605003 0.344218 -0.66946
C  4.358857 -0.609589 -1.652742
C  3.834427 1.835177 -1.083102
C  2.108706 0.012983 -0.647469
C  4.068498 0.111355 0.761376
C  4.215488 -2.111208 -1.329691
C  3.143693 2.874855 -0.177182
C  0.649508 -1.070242 1.260815
C  -0.697718 -0.754149 0.71823
C  -1.019931 0.502237 0.14904
C  -1.694887 -1.753831 0.842638
C  -3.01475 -1.506203 0.417189
C  -2.334265 0.756767 -0.275558
C  -3.356316 -0.225862 -0.11619
C  -4.798256 -2.939808 -0.496097
C  -3.007305 2.025755 -2.240273
C  -5.353695 1.120919 0.272816
H  5.425729 -0.317488 -1.637419
H  3.96531 -0.400749 -2.665051
H  3.471692 1.936657 -2.123289
H  4.927447 2.005802 -1.089312
H  4.777664 -2.711422 -2.066457
H  3.160737 -2.438518 -1.372367
H  4.614437 -2.356326 -0.328628
H  2.045243 2.750211 -0.17295
H  3.502044 2.813016 0.86639
H  3.358614 3.894838 -0.541322
H  -0.275108 1.291372 0.026091
H  -1.453428 -2.720332 1.293542
H  -5.464408 -3.713524 -0.086112
H  -5.380701 -2.093745 -0.895296
H  -4.159888 -3.375487 -1.288492
H  -3.209785 3.077074 -2.494217
H  -2.165968 1.643508 -2.847507
H  -3.907595 1.407284 -2.408271
H  -6.353088 1.218821 -0.176589
H  -5.44017 0.831327 1.335457
H  -4.784999 2.061588 0.175025
