program: Gaussian 09
title: 000130161
version: EM64L-G09RevD.01
frameworkgroup: C1[X(C14H30O2)]
method: RPBEPBE
basis: SDD
operation: Freq
keyword: #pfreq=noraman
keyword: PBEPBE/SDD
title: #p freq=noraman PBEPBE/SDD
converged: YES YES NO NO
title: Mulliken charges:
elementType: O O C C C C C C C C C C C C C C H H H H H H H H H H H H H H H H H H H H H H H H H H H H H H
charge: -0.290923 -0.282150 -0.025983 -0.026038 -0.394254 -0.406920 -0.369395 -0.368456 0.076931 0.037674 -0.700064 -0.700130 -0.705169 -0.691462 -0.689857 -0.683366 0.168954 0.176155 0.222826 0.205683 0.187469 0.221298 0.196653 0.187633 0.196321 0.190712 0.217383 0.184436 0.210597 0.211360 0.212021 0.209411 0.213628 0.213091 0.196561 0.238480 0.217411 0.210648 0.207992 0.224525 0.198387 0.230573 0.223495 0.210738 0.214379 0.220740
chargesum: 0.00000
title: Mulliken charges with hydrogens summed into heavy atoms:
elementType: O O C C C C C C C C C C C C C C
charge: -0.290923 -0.282150 0.142971 0.150117 0.034255 0.001847 0.014891 0.018577 0.294314 0.222111 -0.066086 -0.063999 -0.052717 -0.048297 -0.037401 -0.037508
polarizability: 1.67842482e+02 -2.44544517e+00 1.66924817e+02 1.33399896e+00 1.91447476e+00 1.53133962e+02
1716.lowfreq: -21.8382 -7.0897 -0.0008 -0.0004 -0.0002 8.3524 13.8487 29.6973 35.2679
frequency: -18.0255 29.2461 35.2414 37.8962 47.3670 53.6976 59.5609 71.5105 79.5671 120.4911 160.0378 180.4241 182.1426 188.6422 192.1420 214.2797 222.0140 228.9882 235.8688 238.4980 254.3643 291.3796 304.1246 325.9641 361.2625 399.8787 414.6938 423.8956 446.2030 478.4204 532.6665 552.6942 619.1466 731.9048 740.7093 799.1998 819.0205 826.4693 845.2612 882.7883 892.5751 900.5000 913.5201 917.0088 918.6599 931.3010 935.0669 936.2649 937.9307 996.7237 1033.6196 1039.6294 1052.3085 1077.8696 1089.3327 1106.4250 1109.7354 1120.9154 1142.6385 1145.8567 1149.7702 1163.6748 1180.0761 1181.3142 1217.5184 1237.4995 1263.3431 1279.0030 1288.6085 1291.7882 1293.1885 1309.0760 1317.2609 1324.5206 1328.9299 1339.9747 1348.3082 1351.2322 1363.6780 1369.8134 1377.9409 1380.1116 1384.1656 1386.6246 1391.1906 1392.6566 1453.7403 1455.7296 1459.7434 1463.1450 1464.3660 1466.2100 1469.2213 1470.5263 1471.8067 1472.4777 1474.7336 1475.9270 1483.8578 1484.7844 1485.9044 1486.4101 2906.9074 2938.3293 2942.6902 2959.3733 2960.2834 2970.6555 2970.9688 2977.2166 2977.7488 2978.0527 2988.1359 2988.2530 2989.1007 2997.8632 3003.7070 3004.7500 3040.9927 3049.6103 3067.7924 3068.2654 3068.7300 3069.1172 3069.7310 3071.6670 3080.5566 3082.1589 3088.8274 3089.2263 3097.6425 3100.1558
redmass: 1.6316 3.4506 2.7557 2.5737 2.5034 1.8137 3.2367 3.1430 3.0722 3.2920 3.2206 1.4937 1.5160 2.4285 1.0452 1.4951 1.1443 1.1617 1.1517 2.2230 2.1473 2.5476 2.9546 2.7909 2.4259 2.9182 3.1760 2.7995 2.4956 3.0012 3.4374 2.8591 3.1062 1.1192 1.1773 2.6682 2.1432 2.5587 1.3793 2.1284 2.0248 1.8540 1.6988 1.3149 1.4287 2.6505 2.0481 1.5781 1.5121 2.2004 1.6325 3.1234 2.3308 2.1838 2.3535 1.8233 1.8055 2.3015 2.0646 2.1097 2.1621 2.2868 2.0433 1.9943 1.4402 1.3406 1.2422 1.2160 1.1810 1.1228 1.1919 1.1985 1.2952 1.4405 1.4442 1.3853 1.4570 1.4838 1.4286 1.2678 1.2816 1.2560 1.2154 1.2186 1.2329 1.2278 1.0485 1.0493 1.0681 1.0519 1.0524 1.0685 1.0481 1.0519 1.0686 1.0638 1.0427 1.0432 1.0490 1.0672 1.0728 1.0572 1.0813 1.0826 1.0831 1.0589 1.0591 1.0362 1.0362 1.0355 1.0360 1.0599 1.0455 1.0494 1.0361 1.0851 1.0978 1.0990 1.1023 1.1025 1.0996 1.0999 1.0993 1.1004 1.0997 1.0988 1.1003 1.1005 1.0992 1.0994 1.1001 1.0999
irintensity: 0.0465 0.0950 0.5460 0.2490 0.0732 0.0361 1.0721 0.8948 0.1522 2.3049 0.5543 0.1074 0.4509 0.8912 0.0823 0.7856 0.0550 0.9463 0.0527 0.1504 0.6834 1.0713 0.3875 4.1343 0.0976 5.4041 6.5165 1.2657 2.9842 2.8507 1.9018 0.3898 0.6364 10.0880 12.3747 2.7080 8.8203 2.2786 3.7567 17.7791 27.3161 9.6602 22.6526 3.3833 0.5545 154.1097 67.6003 30.5494 14.6350 17.2758 40.2782 45.8275 13.4096 6.8676 21.7754 54.3013 28.3203 27.4549 5.2370 6.0075 20.6346 9.1658 16.8564 18.5062 0.6062 7.0728 9.1046 1.7021 5.7447 3.8750 19.3841 15.7212 10.5725 6.3344 7.9094 5.6730 0.1569 0.6042 5.2309 4.7867 55.8090 8.1732 10.3210 10.1000 26.8952 20.4229 4.5550 5.7289 2.2611 3.0263 3.7924 2.6810 6.2896 8.7269 4.0710 4.1281 11.6324 12.7150 10.1000 12.8829 18.1493 16.3751 42.9666 16.1959 51.7630 20.5015 55.7021 51.8273 21.1985 19.7088 33.6897 43.2560 5.5074 59.0115 19.1180 16.5800 16.1473 7.9505 29.9757 15.0525 15.3810 169.5973 0.3242 59.5217 75.5156 42.0555 5.7821 9.8127 67.6967 55.0310 38.0546 30.2676
temp: 298.150 k
press: 1.00000 atm
elementType: 8 8 6 6 6 6 6 6 6 6 6 6 6 6 6 6 1 1 1 1 1 1 1 1 1 1 1 1 1 1 1 1 1 1 1 1 1 1 1 1 1 1 1 1 1 1
symmnumber: 1
zpe: 1087847.5 jmol-1
zpe.correction: 0.414339 hartree
zpe.thermalcorrener: 0.435756 hartree
zpe.thermalcorrenthalpy: 0.436700 hartree
zpe.thermalcorrgfe: 0.362715 hartree
zpe.sumelectzpe: -700.562750 hartree
zpe.sumelectthermal: -700.541333 hartree
zpe.sumelectthermalent: -700.540389 hartree
zpe.sumelectthermalfe: -700.614374 hartree
dipole: -1.4863 0.4259 -1.9304
dipole: 2.4733
quadrupole: -99.0835 -103.3442 -101.7360
quadrupole: -0.4794 -0.1511 3.4102
quadrupole: 2.3044 -1.9563 -0.3481 -0.4794 -0.1511 3.4102
hfenergy: -700.9770889 hartree
pointgroup: C01 [X(C14H30O2)]
dipole: -0.5831413 0.0649227 -0.7762607 debye
polarizability: 168.4401991|-2.2378424|166.3559713|1.4939479|1.7022477|153.1050906 unknown
InChI: InChI=1S/C14H30O2/c1-7-9-13(10-8-2)14(15-11(3)4)16-12(5)6/h11-14H,7-10H2,1-6H3
charge 0 multiplicity 1
46 atoms
O  -0.797514 0.570354 1.104208
O  -0.811063 -1.457569 -0.120192
C  1.120574 0.111578 -0.285119
C  -0.412588 -0.030213 -0.145669
C  1.852125 -0.578591 0.897234
C  1.541188 1.597662 -0.449699
C  3.334514 -0.907515 0.606842
C  1.021804 2.296561 -1.729293
C  -2.264034 0.655132 1.354509
C  -1.217839 -2.010705 -1.438508
C  4.026659 -1.602228 1.800256
C  1.618495 3.709673 -1.909438
C  -2.406587 0.787182 2.874383
C  -2.872334 1.847729 0.591673
C  -0.952363 -3.519566 -1.356606
C  -2.695357 -1.684958 -1.735163
H  1.387099 -0.431439 -1.220224
H  -0.937169 0.454475 -1.002068
H  1.315962 -1.51608 1.139821
H  1.778326 0.068135 1.793118
H  2.648514 1.649496 -0.455655
H  1.200372 2.157707 0.442968
H  3.891273 0.016787 0.351896
H  3.393502 -1.563499 -0.286801
H  -0.083638 2.375359 -1.698682
H  1.269857 1.674599 -2.614751
H  -2.717984 -0.296651 1.013867
H  -0.573941 -1.566067 -2.229776
H  5.0828 -1.842266 1.576491
H  3.510537 -2.545833 2.0597
H  4.008251 -0.955294 2.697688
H  2.721066 3.66534 -1.991553
H  1.373892 4.353798 -1.043826
H  1.230191 4.20311 -2.819651
H  -3.471975 0.849279 3.162666
H  -1.952008 -0.083559 3.37625
H  -1.893187 1.698886 3.229568
H  -3.962293 1.904454 0.770961
H  -2.716726 1.759718 -0.499524
H  -2.411855 2.792939 0.930969
H  -1.243421 -4.020418 -2.298108
H  0.116471 -3.714555 -1.164174
H  -1.536107 -3.960894 -0.529161
H  -2.989483 -2.075596 -2.727312
H  -2.878453 -0.594579 -1.732514
H  -3.345053 -2.147479 -0.970499
