program: Gaussian 09
title: 000130188
version: EM64L-G09RevD.01
frameworkgroup: C1[X(C22H29N3O3)]
method: RPBEPBE
basis: SDD
operation: Freq
keyword: #p
keyword: freq=noraman
keyword: PBEPBE/SDD
title: #p freq=noraman PBEPBE/SDD
converged: YES YES NO NO
title: Mulliken charges:
elementType: O O O N N N C C C C C C C C C C C C C C C C C C C C C C H H H H H H H H H H H H H H H H H H H H H H H H H H H H H
charge: -0.257861 -0.292776 -0.264169 -0.134623 -0.176989 -0.111528 0.018607 -0.442215 -0.436343 -0.425677 -0.424016 -0.410352 -0.419022 0.244463 -0.324673 -0.269551 -0.274462 0.139296 0.365178 -0.768618 -0.375522 -0.334124 -0.329272 -0.342960 0.221128 0.178808 -0.218147 -0.675515 0.196701 0.211547 0.202736 0.214339 0.206243 0.202820 0.193435 0.201194 0.295284 0.202949 0.213305 0.227103 0.216837 0.211953 0.210982 0.221227 0.236855 0.224148 0.256709 0.224965 0.254971 0.250634 0.271266 0.268090 0.227684 0.228225 0.228530 0.228624 0.211581
chargesum: 0.00000
title: Mulliken charges with hydrogens summed into heavy atoms:
elementType: O O O N N N C C C C C C C C C C C C C C C C C C C C C C
charge: -0.257861 -0.292776 -0.264169 -0.134623 -0.176989 -0.111528 0.215308 -0.027931 -0.015762 -0.029422 0.072462 0.005902 0.024917 0.244463 0.098262 -0.048323 -0.037608 0.139296 0.365178 -0.062796 -0.120550 -0.083490 -0.058006 -0.074870 0.221128 0.178808 0.237762 -0.006781
polarizability: 4.49691962e+02 8.07867656e+00 2.38888768e+02 -2.08189706e+01 1.23794726e+01 1.86894335e+02
1716.lowfreq: -0.0013 -0.0009 0.0008 0.6077 2.6961 7.0789 10.3035 13.3367 16.1591
frequency: 7.1843 13.0459 16.1057 28.2681 39.0641 42.8829 52.1026 67.9086 73.5201 75.9555 91.4431 101.7074 110.2614 117.4012 131.3646 140.6127 159.0712 170.2086 186.6261 228.3162 233.7752 246.8589 265.0661 280.0982 292.1050 307.8197 332.0155 333.8697 343.0506 365.1230 394.7179 406.5359 417.3427 442.6114 456.9465 464.1528 478.7312 490.6251 500.6050 507.3302 523.8265 590.7032 625.4367 634.1871 636.6717 677.8234 683.5814 739.6469 754.4225 755.0611 773.4044 789.2984 793.4443 798.3529 806.9042 810.4331 810.9191 825.5995 848.9604 855.3091 868.9886 921.5784 932.5397 956.0985 960.9661 962.5484 968.2657 971.7665 978.2350 986.9440 990.7610 999.6220 1021.2007 1023.3648 1039.2525 1046.4010 1052.9417 1061.4125 1076.3193 1097.2895 1111.8570 1116.2057 1117.7602 1128.5647 1136.6060 1141.7070 1156.7107 1162.5513 1171.7016 1173.9481 1185.0565 1222.9443 1229.1374 1244.6765 1248.4889 1249.2286 1252.6299 1258.1082 1266.4427 1279.0850 1291.0714 1299.4144 1300.7701 1309.7382 1319.1499 1335.7574 1343.2794 1352.7776 1358.6619 1359.0850 1363.1655 1372.0693 1374.5961 1387.9424 1393.0745 1399.2781 1428.5588 1431.9414 1450.4501 1457.8473 1463.5441 1465.9969 1467.5872 1469.4122 1470.5774 1472.5535 1473.9607 1477.9538 1485.7869 1487.4180 1498.4537 1537.6513 1571.5385 1591.1599 1615.2891 1620.2402 2929.2979 2932.3358 2936.8362 2949.5380 2954.2282 2974.6921 2977.4642 2978.4896 2994.5461 2995.5531 3004.2682 3007.9525 3010.3315 3036.8678 3043.9575 3054.1636 3065.3452 3065.4821 3087.2575 3091.0845 3092.7700 3105.7806 3108.4519 3134.8982 3152.2987 3157.2338 3166.1839 3172.3092 3178.9975
redmass: 4.9496 4.3009 4.6490 4.6937 2.7683 4.0093 3.9761 3.7429 2.9116 2.3953 3.9494 1.5764 3.8259 2.9515 2.9164 2.3458 3.9218 3.8006 2.5662 2.1899 3.8298 1.2666 5.0826 2.9367 3.9348 5.9801 2.5020 3.5163 2.8731 4.9174 5.0251 2.9226 2.9854 2.1864 3.5594 3.8983 3.9466 4.4747 3.4468 2.9505 4.0601 2.4641 6.7577 6.7167 6.9481 4.1314 3.8659 4.2926 1.5089 3.0125 5.7632 5.5468 1.8925 1.1039 2.3932 2.6566 1.6218 1.3388 4.3030 1.6093 1.3816 2.8801 1.8912 2.9386 1.3515 2.7377 1.7416 1.3663 3.3225 2.1870 1.3448 3.1842 1.5070 2.2614 2.5272 1.5024 2.6608 4.7892 2.9923 2.2221 2.1926 2.3189 1.3447 2.6926 1.4672 1.7066 1.2697 2.7708 1.5758 1.3360 2.0544 1.5674 3.1421 1.3641 1.2069 3.0009 1.6793 1.4064 1.4377 1.2458 1.1121 1.2866 1.3637 1.6947 1.4840 1.3451 1.3981 1.6073 1.4648 1.4493 2.5776 1.5484 2.5997 2.0642 1.2793 1.2716 4.2563 2.5720 1.0921 1.0908 1.0406 1.0771 1.0842 1.0743 1.1238 1.1255 1.0586 1.1772 1.1913 1.0816 2.0595 4.3820 8.0930 6.4392 9.9962 6.6965 1.0724 1.0797 1.0721 1.0564 1.0584 1.0593 1.0384 1.0597 1.0357 1.0616 1.0996 1.0581 1.1058 1.1022 1.1016 1.0979 1.1044 1.1064 1.0896 1.0985 1.0920 1.1025 1.0976 1.0894 1.0882 1.0876 1.0962 1.0968 1.0965
irintensity: 0.0715 1.4056 1.2113 2.8591 0.4640 1.7229 1.9610 1.1176 0.6944 2.1283 0.0570 1.7114 1.1132 0.9062 0.2993 0.1122 7.0268 2.3382 2.0115 1.3696 4.8294 1.2756 3.8634 0.9518 2.3429 0.0771 1.7321 18.4717 4.7483 1.9487 0.5299 1.3148 0.0743 0.1127 0.4805 1.3633 8.0613 2.9206 0.3895 8.2524 0.1909 10.3170 7.8606 1.6678 18.3880 26.0526 0.6094 0.1826 15.6242 7.5021 15.2460 10.3111 3.5026 1.7759 7.9585 9.1527 28.0317 4.9568 4.2114 49.8013 11.1316 13.1802 12.7392 184.9507 0.3232 15.8790 6.9501 1.1095 32.7626 1.6552 0.1165 24.4920 12.8414 31.2195 2.3598 6.5095 23.0338 382.5621 37.0956 4.7748 3.1493 7.8150 6.2723 14.7156 5.4628 3.5465 4.3359 22.5373 170.1399 133.8318 9.0744 64.4838 199.6493 25.3996 47.5118 475.3297 12.3105 3.0340 67.0216 5.2420 7.1631 0.0010 0.0812 8.8370 39.1851 6.4771 18.2708 15.3494 3.9251 7.8858 27.7668 3.3169 9.5328 22.4006 14.4953 20.1740 30.0434 102.2278 5.1669 9.5065 11.9471 19.2303 9.5523 28.8400 48.5748 28.4619 5.4547 15.1929 64.8895 7.2136 57.3000 199.6619 75.4271 214.1324 118.6629 333.3937 40.0210 4.3891 105.5862 9.3811 43.2735 32.3867 53.6571 37.4335 23.0699 25.7020 20.0638 25.4196 13.8473 31.7937 91.7613 24.1209 56.6915 16.3655 24.8257 35.1700 8.8480 46.8312 8.4750 16.7844 0.7345 10.6842 19.0838 7.2232 5.8824
temp: 298.150 k
press: 1.00000 atm
elementType: 8 8 8 7 7 7 6 6 6 6 6 6 6 6 6 6 6 6 6 6 6 6 6 6 6 6 6 6 1 1 1 1 1 1 1 1 1 1 1 1 1 1 1 1 1 1 1 1 1 1 1 1 1 1 1 1 1
symmnumber: 1
zpe: 1242756.7 jmol-1
zpe.correction: 0.473341 hartree
zpe.thermalcorrener: 0.501565 hartree
zpe.thermalcorrenthalpy: 0.502509 hartree
zpe.thermalcorrgfe: 0.408681 hartree
zpe.sumelectzpe: -1243.540747 hartree
zpe.sumelectthermal: -1243.512524 hartree
zpe.sumelectthermalent: -1243.511579 hartree
zpe.sumelectthermalfe: -1243.605408 hartree
dipole: 0.2810 -0.4054 -1.0257
dipole: 1.1381
quadrupole: -201.1717 -166.9613 -163.8022
quadrupole: -49.3936 -18.9060 -0.5567
quadrupole: -23.8600 10.3504 13.5096 -49.3936 -18.9060 -0.5567
hfenergy: -1244.0140881 hartree
pointgroup: C01 [X(C22H29N3O3)]
dipole: 0.1124891 0.2102507 0.3790057 debye
polarizability: 450.0695538|-4.2394998|241.1263362|19.5375279|5.5400348|184.2791747 unknown
InChI: InChI=1S/C22H29N3O3/c1-3-27-22(26)19-7-9-20(10-8-19)28-16-4-5-18-12-14-25(15-13-18)21-11-6-17(2)23-24-21/h6-11,18H,3-5,12-16H2,1-2H3
charge 0 multiplicity 1
57 atoms
O  -2.465943 1.01534 -0.324714
O  -8.471939 -1.040768 0.685955
O  -8.873208 1.254585 0.575264
N  5.260647 0.198019 -0.572051
N  7.193836 -1.11233 -0.268816
N  8.408433 -1.371546 0.301803
C  2.365793 -0.101744 -1.059076
C  3.36433 -1.273679 -1.238705
C  2.931635 0.894304 -0.015711
C  0.956528 -0.624836 -0.684227
C  4.785341 -0.777318 -1.579984
C  4.365347 1.351584 -0.378767
C  -0.130267 0.473497 -0.622482
C  6.494214 0.048499 0.048342
C  -1.520685 -0.118884 -0.3870
C  7.049152 1.004434 0.964152
C  8.291125 0.719292 1.536059
C  8.963236 -0.489548 1.19572
C  -3.819126 0.739903 -0.11238
C  10.305633 -0.87611 1.773425
C  -4.669992 1.876472 -0.068479
C  -4.358323 -0.563452 0.054005
C  -6.045711 1.709548 0.140669
C  -5.742934 -0.718298 0.26413
C  -6.59978 0.409765 0.309994
C  -8.06377 0.291856 0.529209
C  -9.932642 -1.247011 0.909831
C  -10.145921 -2.748837 1.071764
H  2.287017 0.433081 -2.03282
H  3.405511 -1.869653 -0.304866
H  3.017028 -1.949093 -2.045329
H  2.287914 1.7915 0.059553
H  2.946922 0.40932 0.981363
H  1.015492 -1.148814 0.293125
H  0.658864 -1.390718 -1.431322
H  4.776532 -0.285834 -2.578278
H  5.510679 -1.604148 -1.608466
H  4.751004 2.01368 0.41139
H  4.328737 1.948084 -1.317995
H  0.084591 1.192022 0.189827
H  -0.143003 1.048098 -1.56892
H  -1.557045 -0.684105 0.567568
H  -1.811876 -0.797714 -1.215316
H  6.536702 1.936706 1.213521
H  8.750895 1.422877 2.238512
H  11.077799 -0.114683 1.554364
H  10.62397 -1.835211 1.334589
H  10.257113 -0.992148 2.872787
H  -4.22671 2.867782 -0.200731
H  -3.717313 -1.448796 0.022331
H  -6.717837 2.572924 0.177433
H  -6.171427 -1.715964 0.394448
H  -10.480292 -0.832253 0.043943
H  -10.232751 -0.676717 1.807734
H  -9.821975 -3.29294 0.167965
H  -9.578479 -3.136901 1.935042
H  -11.218369 -2.958617 1.238114
