program: Gaussian 09
title: 000130155
version: EM64L-G09RevD.01
frameworkgroup: C1[X(C15H12F4N2O3)]
method: RPBEPBE
basis: SDD
operation: Freq
keyword: #p
keyword: freq=noraman
keyword: PBEPBE/SDD
title: #p freq=noraman PBEPBE/SDD
converged: YES YES NO NO
title: Mulliken charges:
elementType: F F F F O O O N N C C C C C C C C C C C C C C C H H H H H H H H H H H H
charge: -0.180265 -0.175297 -0.155485 -0.155624 -0.246664 -0.227452 -0.272189 -0.346413 -0.603184 0.270542 0.298581 -0.002260 -0.051522 0.250777 -0.438867 -0.362302 -0.413801 0.183963 -0.398343 0.262015 0.136996 -0.485408 -0.532733 0.254133 0.323517 0.286649 0.260852 0.260014 0.332506 0.289014 0.254480 0.227091 0.229101 0.257295 0.343355 0.326930
chargesum: 0.00000
title: Mulliken charges with hydrogens summed into heavy atoms:
elementType: F F F F O O O N N C C C C C C C C C C C C C C C
charge: -0.180265 -0.175297 -0.155485 -0.155624 -0.246664 -0.227452 -0.272189 -0.013907 0.067100 0.270542 0.298581 -0.002260 -0.051522 0.250777 -0.115350 -0.075653 -0.152949 0.183963 -0.138329 0.262015 0.136996 0.058086 0.180754 0.254133
polarizability: 2.53149890e+02 -1.60494605e+01 2.40153680e+02 -1.39084571e+00 -3.43985115e+00 1.03324111e+02
1716.lowfreq: -3.0234 -0.0008 0.0004 0.0006 3.7638 5.7959 19.2325 27.9170 32.0844
frequency: 19.2260 27.8952 32.0738 44.8105 48.1603 63.5775 65.4725 88.3386 105.0229 126.3975 159.2065 173.3485 194.0782 207.4493 216.7145 236.1307 262.0690 275.9538 291.8756 321.1057 331.0740 334.1349 340.6077 372.8714 391.1620 433.3062 454.6862 458.7910 461.1870 487.6949 525.5253 534.4851 537.6710 560.0361 571.2685 586.9721 596.8244 610.0692 628.9026 639.9144 651.0928 687.4145 718.4012 739.7595 760.5523 786.4199 800.3529 819.3428 820.5662 840.0823 893.3508 940.9902 959.3594 973.5720 984.0381 984.1748 1005.1950 1023.7665 1047.1612 1058.7957 1089.9594 1109.8983 1149.7982 1166.5587 1176.9964 1217.8141 1229.5028 1237.9577 1253.6961 1265.2115 1279.1139 1296.4760 1343.8418 1360.9436 1379.3918 1400.9128 1411.7505 1432.5033 1440.3938 1466.4326 1472.4118 1475.0125 1486.3895 1523.8834 1576.4359 1599.1838 1605.7728 1614.3335 1623.1610 1653.7024 2972.7839 2995.2424 3057.7601 3067.5870 3129.7293 3137.3349 3172.3460 3176.9828 3239.3465 3516.4451 3560.3214 3667.5735
redmass: 8.6793 4.8828 7.7753 6.9244 8.4862 6.8669 3.8717 4.7082 6.1792 7.5720 3.5816 5.6006 9.2633 6.8020 4.8066 1.4214 10.2188 3.1160 4.9593 6.3755 6.6018 6.5738 6.4964 6.9407 6.0686 3.6825 4.6517 2.0656 5.8453 5.2741 4.4815 1.2870 6.1359 1.3965 5.4098 5.0198 5.5343 4.8042 2.2766 2.5746 7.9319 6.3894 4.8897 6.3755 7.3728 5.7611 4.5545 1.9885 2.7977 1.5414 5.9398 8.9449 1.4296 5.6719 6.9602 5.8344 1.3440 3.4437 5.3736 2.1285 3.6416 1.2521 1.4094 3.3459 1.3886 1.8746 3.1457 1.4395 1.9903 4.2013 1.7566 1.7389 4.5145 2.4810 3.2451 9.0412 2.8591 1.1153 1.3099 1.3193 1.0546 1.6383 1.9736 4.0744 7.9517 1.7071 5.2752 5.2186 6.3151 3.7311 1.0325 1.0590 1.1018 1.1048 1.0933 1.1002 1.0919 1.0931 1.0921 1.0449 1.0784 1.1044
irintensity: 0.0604 1.1053 3.6317 2.7471 11.1831 4.8872 2.1998 2.7193 5.3737 10.9588 3.2729 2.6534 2.0056 0.2214 1.8996 0.9544 0.6410 8.3846 6.9184 3.1248 0.0795 2.0500 5.6805 6.9569 3.6032 18.5451 12.6793 0.7850 0.0909 13.4443 3.9236 144.0899 8.6734 131.7152 0.8795 21.5229 30.2020 21.0878 48.8490 72.8999 7.5528 1.9278 8.9990 1.7600 3.0187 3.0987 9.9702 21.9796 5.5384 41.6212 4.2871 26.0703 17.1614 161.3723 120.9390 171.9326 8.6880 88.3683 22.5286 7.6860 106.5995 0.3519 2.4452 111.3439 25.8632 180.0138 69.6244 22.9090 145.9118 238.3467 14.3213 20.5617 46.4591 108.5875 5.2095 5.5603 67.7286 42.5294 7.0066 41.5877 17.2383 62.0484 185.2141 203.5256 25.5895 70.9158 61.3723 163.9492 57.0634 336.6922 63.1989 48.2318 3.1505 36.3803 49.6985 19.2981 2.0968 4.3409 6.1051 48.5532 23.3155 29.7383
temp: 298.150 k
press: 1.00000 atm
elementType: 9 9 9 9 8 8 8 7 7 6 6 6 6 6 6 6 6 6 6 6 6 6 6 6 1 1 1 1 1 1 1 1 1 1 1 1
symmnumber: 1
zpe: 659999.9 jmol-1
zpe.correction: 0.251381 hartree
zpe.thermalcorrener: 0.273884 hartree
zpe.thermalcorrenthalpy: 0.274828 hartree
zpe.thermalcorrgfe: 0.197140 hartree
zpe.sumelectzpe: -1311.631019 hartree
zpe.sumelectthermal: -1311.608515 hartree
zpe.sumelectthermalent: -1311.607571 hartree
zpe.sumelectthermalfe: -1311.685260 hartree
dipole: -6.5599 -5.1333 -2.9373
dipole: 8.8324
quadrupole: -115.8225 -120.9867 -141.4785
quadrupole: 14.4028 14.2749 -5.7216
quadrupole: 10.2734 5.1092 -15.3826 14.4028 14.2749 -5.7216
hfenergy: -1311.8823995 hartree
pointgroup: C01 [X(C15H12F4N2O3)]
dipole: 2.581811 -2.0120483 1.1665944 debye
polarizability: 253.4613318|15.0917475|238.9206218|-10.5842002|-7.238059|104.2457271 unknown
InChI: InChI=1S/C15H12F4N2O3/c1-24-10-5-3-7-8(13(10)15(17,18)19)2-4-9(16)12(7)14(23)21-6-11(20)22/h2-5,21H,6,20H2,1H3
charge 0 multiplicity 1
36 atoms
F  1.903556 3.740318 -0.312569
F  -4.165907 1.768826 0.581034
F  -4.699966 -0.05619 -0.616701
F  -4.391278 -0.19658 1.633026
O  -3.189053 -2.211601 0.26576
O  3.116442 1.140111 -1.598194
O  3.222196 -2.39349 0.194362
N  3.164924 0.373183 0.598353
N  5.542842 -2.464399 0.174144
C  -1.337142 1.016984 0.092308
C  0.026477 0.526998 -0.078204
C  -2.407811 0.049062 0.229449
C  1.125663 1.455148 -0.216928
C  -2.113543 -1.337857 0.159093
C  0.270343 -0.88384 -0.122724
C  -1.531501 2.445723 0.096662
C  -0.772548 -1.793693 -0.014414
C  0.847959 2.81721 -0.197473
C  -0.461775 3.328651 -0.042784
C  -3.865215 0.386615 0.446982
C  2.540308 0.982976 -0.482896
C  4.463255 -0.264924 0.447081
C  -2.945017 -3.657262 0.199933
C  4.336836 -1.798943 0.261159
H  1.290935 -1.266158 -0.238749
H  -2.529382 2.863098 0.205937
H  -0.555905 -2.863583 -0.059779
H  -0.615954 4.411355 -0.035648
H  2.628878 0.219857 1.453928
H  4.930391 0.17094 -0.456372
H  5.110944 -0.044224 1.316163
H  -2.292803 -3.991757 1.028343
H  -2.503606 -3.944797 -0.772608
H  -3.941494 -4.108672 0.304762
H  5.535578 -3.474129 0.030279
H  6.436772 -1.975556 0.194685
