program: Gaussian 09
title: 000130198
version: EM64L-G09RevD.01
frameworkgroup: C1[X(C18H26N6O4)]
method: RPBEPBE
basis: SDD
operation: Freq
keyword: #p
keyword: freq=noraman
keyword: PBEPBE/SDD
title: #p freq=noraman PBEPBE/SDD
converged: YES YES NO NO
title: Mulliken charges:
elementType: O O O O N N N N N N C C C C C C C C C C C C C C C C C C H H H H H H H H H H H H H H H H H H H H H H H H H H
charge: -0.247328 -0.441618 -0.494868 -0.463991 -0.191151 -0.083557 -0.274278 -0.356920 -0.113295 -0.619936 -0.152262 -0.060544 -0.169718 -0.080259 -0.349641 0.261526 -0.224382 -0.172733 -0.521459 0.430467 -0.409118 -0.415432 -0.432393 -0.563985 -0.382862 -0.386230 0.181842 0.119556 0.276462 0.229569 0.240449 0.240794 0.210021 0.172219 0.373225 0.363431 0.268329 0.211315 0.214473 0.202517 0.197423 0.203259 0.201148 0.202092 0.240058 0.200195 0.221085 0.222746 0.211638 0.257556 0.423239 0.359610 0.345892 0.325820
chargesum: 0.00000
title: Mulliken charges with hydrogens summed into heavy atoms:
elementType: O O O O N N N N N N C C C C C C C C C C C C C C C C C C
charge: -0.247328 -0.068393 -0.131437 -0.040752 -0.191151 -0.083557 -0.274278 0.002691 -0.113295 0.051775 0.124200 0.169026 0.070731 0.160535 0.032599 0.261526 0.043947 -0.172733 -0.095670 0.430467 -0.009177 -0.011025 0.009758 -0.142705 -0.160115 0.082964 0.181842 0.119556
polarizability: 3.13731571e+02 3.11891697e+00 2.94771579e+02 -1.26939109e+01 1.26509151e+01 1.60101862e+02
1716.lowfreq: -15.5131 -3.5966 -0.0006 0.0005 0.0007 2.6822 5.7536 24.4141 29.5138
frequency: -12.7732 24.3625 29.5028 39.9344 53.3003 60.1626 65.4225 83.9415 110.4416 123.0784 134.7137 146.8556 164.8560 171.8775 187.9557 214.5872 227.7797 231.1706 234.7197 248.6495 259.9222 278.1971 282.9285 296.6988 326.6490 333.0562 361.1563 372.4687 380.8514 411.1224 414.2671 428.0513 460.0099 503.7849 508.6529 520.1298 533.6112 540.9766 552.4006 555.2716 576.1625 598.1265 626.3039 630.5085 651.5323 659.8181 690.4039 698.7421 713.6673 720.1019 752.9268 773.0467 791.0732 798.1957 802.2025 807.3771 821.5680 839.7137 850.9154 860.4408 873.9810 906.0480 926.5527 939.2034 942.0042 948.8673 958.4193 975.0591 976.3036 1001.4681 1026.8408 1027.5323 1032.2444 1048.8178 1051.5859 1063.0819 1068.5526 1069.4496 1076.1026 1096.9535 1107.5472 1123.3519 1138.4420 1143.8487 1160.5817 1166.4492 1170.4173 1196.6171 1204.3940 1212.2534 1220.0553 1233.4655 1239.5184 1243.9999 1253.6830 1261.9305 1264.1708 1275.4630 1282.3599 1294.3928 1300.3521 1305.8061 1319.5008 1321.2594 1333.8596 1336.1111 1340.6815 1347.7730 1347.8650 1366.1788 1371.1314 1372.5883 1383.7329 1390.6195 1440.0594 1449.9345 1452.7973 1458.6065 1458.9411 1460.0337 1466.4620 1472.4358 1482.9361 1488.5993 1554.6759 1572.1400 1576.5997 1596.3126 1631.0081 1681.7371 2609.6573 2903.9919 2940.1594 2952.8819 2956.4950 2973.7329 2974.2671 2977.3149 2994.1216 3002.0549 3007.9363 3016.8047 3020.7157 3034.4247 3043.5879 3046.0176 3047.1897 3073.0116 3079.6806 3093.4462 3237.3264 3440.3514 3470.5224 3541.4418 3611.4886 3697.1819
redmass: 4.5597 4.0809 5.6169 3.6559 5.0296 4.7365 4.4768 5.0320 3.1655 5.7677 2.4853 3.9539 5.2273 5.2411 1.3994 2.6056 5.3781 4.1653 3.9062 3.2003 5.3586 4.9737 2.0679 5.2587 4.2713 5.5056 2.2507 4.8180 3.4252 4.0129 5.1240 3.7153 2.3291 1.2260 5.0582 1.6488 2.5584 3.0633 3.3333 1.0666 4.4070 4.6778 2.1828 4.0297 6.6565 5.9057 2.3888 2.3142 4.3875 3.0982 2.6811 2.6244 3.4715 2.4687 3.4519 1.4903 2.4991 2.3910 2.7750 3.0162 3.0063 2.5832 1.4364 2.0572 2.3565 2.9997 2.2511 2.5590 3.2795 1.4834 1.8091 5.2102 3.9464 2.6689 4.1561 3.1546 2.3781 2.3211 1.8793 2.4481 1.4801 2.0553 1.4512 1.3314 2.5770 2.0840 1.6807 1.5726 1.2874 1.5220 1.4711 1.3335 1.3052 1.3997 1.3582 2.5911 1.3085 1.3703 2.5878 1.4321 3.1390 1.3301 1.3180 1.4294 1.4433 1.5778 1.5098 1.4157 1.5706 1.4647 1.2153 1.7884 1.7638 2.2904 2.8570 3.2907 1.0952 1.1094 1.0849 1.0829 1.0874 1.0965 2.1321 1.1684 3.5204 1.9752 1.6917 2.7099 2.4260 6.7517 1.0756 1.0686 1.0629 1.0654 1.0701 1.0644 1.0665 1.0610 1.0890 1.0853 1.0865 1.0929 1.0895 1.0991 1.1042 1.1002 1.0903 1.0877 1.0921 1.0906 1.0983 1.0781 1.0644 1.0442 1.0670 1.1057
irintensity: 0.1606 0.1048 0.4994 0.4855 3.8086 1.3164 0.6682 2.5654 1.7588 1.2554 23.2166 9.5217 6.6113 1.8838 141.7283 9.9831 8.5067 5.7896 3.6001 1.0724 3.1174 5.7566 2.0661 9.7285 3.6152 1.6114 0.7848 7.6270 3.8499 0.9848 0.4786 6.4812 4.4174 231.7454 21.4111 63.8427 60.6876 11.7744 9.5452 26.8226 5.5298 4.6314 0.1448 30.4993 16.7311 14.0959 12.2252 42.7876 65.6790 28.9543 0.6569 33.2108 8.9118 0.3882 43.5858 8.4830 14.7674 15.6960 6.4647 12.0808 9.0236 13.6592 5.0260 4.4479 34.6582 44.6609 26.5960 15.0462 31.8822 104.5863 3.2558 48.9993 45.6531 31.8426 114.7115 41.5426 27.5861 22.1727 2.7629 9.0831 6.5436 4.6939 0.5774 39.9203 4.6440 15.5597 1.6230 39.6731 41.0549 27.3411 9.1434 29.3442 2.5337 8.4037 10.3509 74.3554 31.9674 1.1736 32.0121 4.5390 6.3678 10.9503 5.2729 14.0682 15.0676 28.0870 12.8084 9.3828 4.9806 43.0971 15.2660 1.5046 127.2785 11.1467 32.0106 26.5046 2.9944 11.8044 4.2636 13.3227 7.9504 10.5604 19.7908 67.3376 664.4563 27.2451 66.8248 654.6699 590.0404 1.5565 1349.8178 66.2076 29.5225 45.8065 70.5272 23.7973 34.7508 46.4563 67.0838 33.6014 28.8759 16.9516 13.0407 74.1360 77.7800 41.6345 57.5656 19.3610 10.1356 29.1024 0.5710 196.7295 54.7995 117.4870 21.9671 46.8798
temp: 298.150 k
press: 1.00000 atm
elementType: 8 8 8 8 7 7 7 7 7 7 6 6 6 6 6 6 6 6 6 6 6 6 6 6 6 6 6 6 1 1 1 1 1 1 1 1 1 1 1 1 1 1 1 1 1 1 1 1 1 1 1 1 1 1
symmnumber: 1
zpe: 1157775.2 jmol-1
zpe.correction: 0.440973 hartree
zpe.thermalcorrener: 0.466245 hartree
zpe.thermalcorrenthalpy: 0.467189 hartree
zpe.thermalcorrgfe: 0.385744 hartree
zpe.sumelectzpe: -1328.795064 hartree
zpe.sumelectthermal: -1328.769792 hartree
zpe.sumelectthermalent: -1328.768848 hartree
zpe.sumelectthermalfe: -1328.850293 hartree
dipole: -0.4496 -2.3101 1.2249
dipole: 2.6531
quadrupole: -165.4118 -130.6801 -172.6618
quadrupole: -14.2714 -8.3476 0.0531
quadrupole: -9.1605 25.5711 -16.4106 -14.2714 -8.3476 0.0531
hfenergy: -1329.2360372 hartree
pointgroup: C01 [X(C18H26N6O4)]
dipole: -0.1493812 -0.8333057 0.6106192 debye
polarizability: 313.3741135|1.6205023|295.6373019|-14.4212254|-7.6205413|159.593597 unknown
InChI: InChI=1S/C18H26N6O4/c19-15-12-16(23-18(22-15)20-7-6-10-4-2-1-3-5-10)24(9-21-12)17-14(27)13(26)11(8-25)28-17/h4,9,11,13-14,17,20,25-27H,1-3,5-8,19H2
charge 0 multiplicity 1
54 atoms
O  2.165081 -1.660556 -1.034446
O  4.758896 -1.335808 1.532402
O  4.052035 -3.618508 0.440773
O  -0.515879 -1.719843 -0.302564
N  2.942993 0.550182 -0.51933
N  3.426348 2.7947 -0.657753
N  0.457333 0.72506 -0.255181
N  -1.799685 1.24661 0.004852
N  -0.31225 3.067814 -0.215318
N  1.179353 4.875118 -0.469243
C  3.398805 -1.415517 1.046783
C  3.238495 -0.885793 -0.418855
C  2.875467 -2.87324 0.926828
C  1.73864 -2.751793 -0.101115
C  0.386625 -2.399566 0.593088
C  1.715832 1.219075 -0.400918
C  3.930081 1.553761 -0.675757
C  2.042703 2.599084 -0.487702
C  -5.237626 -0.14934 1.001395
C  -4.475994 0.03759 -0.307731
C  -5.730972 -1.602738 1.196749
C  -4.60226 -2.608596 0.873524
C  -4.158266 -2.47703 -0.602612
C  -4.162497 1.46458 -0.737287
C  -4.024677 -1.027948 -1.029661
C  -2.997751 2.086319 0.090005
C  0.961495 3.525372 -0.391851
C  -0.518806 1.707594 -0.157902
H  2.778311 -0.822723 1.737645
H  4.186891 -1.057411 -0.964851
H  2.530216 -3.283431 1.895876
H  1.620064 -3.646239 -0.738112
H  -0.098566 -3.338938 0.920115
H  0.58495 -1.783702 1.502499
H  5.226178 -2.148382 1.191603
H  3.822426 -4.561851 0.262048
H  4.982855 1.300908 -0.778003
H  -6.098298 0.550884 1.026936
H  -4.591068 0.141271 1.857918
H  -6.588021 -1.792395 0.519657
H  -6.096392 -1.743473 2.232179
H  -3.734255 -2.404021 1.532583
H  -4.932148 -3.644247 1.083112
H  -4.879582 -2.998654 -1.267816
H  -3.179405 -2.973371 -0.753031
H  -5.048839 2.118533 -0.60969
H  -3.877991 1.487216 -1.805998
H  -3.497088 -0.843467 -1.977177
H  -3.31161 2.203049 1.148742
H  -2.736778 3.088532 -0.286997
H  -0.088394 -0.775513 -0.440439
H  -1.926166 0.226273 0.028917
H  2.12811 5.221015 -0.597328
H  0.391084 5.513752 -0.394162
