program: Gaussian 09
title: 000012073
version: EM64L-G09RevD.01
frameworkgroup: C1[X(C9H10O2)]
method: RPBEPBE
basis: SDD
operation: Freq
keyword: #pfreq=noraman
keyword: PBEPBE/SDD
title: #p freq=noraman PBEPBE/SDD
converged: YES YES NO NO
title: Mulliken charges:
elementType: O O C C C C C C C C C H H H H H H H H H H
charge: -0.442864 -0.257399 0.345392 0.336373 -0.546843 0.267711 -0.399876 -0.340227 -0.809326 -0.805050 0.104073 0.273601 0.235624 0.273634 0.237653 0.226770 0.226768 0.230108 0.230117 0.232082 0.381679
chargesum: 0.00000
title: Mulliken charges with hydrogens summed into heavy atoms:
elementType: O O C C C C C C C C C
charge: -0.061185 -0.257399 0.345392 0.336373 -0.273242 0.267711 -0.164252 -0.066593 -0.118135 -0.112743 0.104073
polarizability: 1.52490329e+02 -1.60689806e+00 1.10986707e+02 6.60769090e-03 -4.38745810e-03 5.09739845e+01
1716.lowfreq: -14.5001 -9.8031 0.0001 0.0005 0.0005 4.0532 64.1903 96.9036 100.4358
frequency: 64.1759 96.5246 100.4060 154.9524 169.3559 198.0186 288.5036 289.2916 336.9328 373.7770 440.6207 510.7866 511.2888 527.1028 580.3794 602.3539 690.4046 702.7876 738.0052 743.9595 848.9007 889.9274 931.6657 981.1242 987.4711 992.7875 1033.2791 1046.5888 1054.2459 1123.1357 1155.8642 1193.2987 1241.3548 1277.5388 1324.5424 1380.7265 1392.3595 1405.9110 1411.6711 1458.6682 1467.7205 1474.4073 1477.0123 1496.0124 1576.7506 1622.8751 1641.8552 2971.0508 2972.9505 3042.1129 3046.1799 3088.4914 3092.1447 3130.8049 3144.5511 3177.4238 3531.0339
redmass: 6.8137 1.0747 3.5032 1.1114 5.3572 2.6584 3.4570 2.5545 6.3172 3.9711 2.7887 3.6859 2.5549 5.9514 4.7788 1.3248 4.8585 4.0053 4.3866 2.9252 1.3933 4.8625 1.3871 1.3614 1.5480 1.6505 1.4756 2.4588 1.6677 1.7903 1.5394 2.2024 2.4645 1.4323 2.4554 5.0988 1.2460 1.4354 2.5124 1.0471 1.2014 1.0454 1.2283 2.3175 6.8877 6.2810 8.4496 1.0377 1.0386 1.0966 1.0966 1.0985 1.0977 1.0898 1.0919 1.0951 1.0641
irintensity: 1.4097 0.0611 0.7871 1.4241 1.4634 1.4794 1.2400 0.8128 6.0667 0.7100 8.2476 13.9225 27.7046 4.8864 29.7884 104.4992 10.6707 30.2551 0.7345 32.5801 19.8805 32.8978 6.5230 3.2961 80.8808 1.7278 19.6273 188.0583 0.3061 80.4534 50.4277 10.1683 1.0081 18.7401 88.5201 2.7794 9.5595 41.5886 15.9383 1.3868 27.3946 32.0295 0.6858 17.6765 18.0791 78.4914 257.0913 42.3066 15.6505 39.5585 0.7880 31.0364 8.1450 18.1579 2.0728 2.8819 43.3243
temp: 298.150 k
press: 1.00000 atm
elementType: 8 8 6 6 6 6 6 6 6 6 6 1 1 1 1 1 1 1 1 1 1
symmnumber: 1
zpe: 437857.5 jmol-1
zpe.correction: 0.166771 hartree
zpe.thermalcorrener: 0.177476 hartree
zpe.thermalcorrenthalpy: 0.178421 hartree
zpe.thermalcorrgfe: 0.130369 hartree
zpe.sumelectzpe: -498.624169 hartree
zpe.sumelectthermal: -498.613464 hartree
zpe.sumelectthermalent: -498.612520 hartree
zpe.sumelectthermalfe: -498.660571 hartree
dipole: 2.5411 -1.3278 0.0003
dipole: 2.8671
quadrupole: -54.9588 -64.2324 -67.1808
quadrupole: 5.9814 0.0006 -0.0002
quadrupole: 7.1652 -2.1084 -5.0568 5.9814 0.0006 -0.0002
hfenergy: -498.7909403 hartree
pointgroup: C01 [X(C9H10O2)]
dipole: -1.0127297 -0.4967243 -0.000108 debye
dipolederiv: -0.9149382 0.4884073 -0.0000198 0.6513953 -0.807411 0.0000317 -0.0000049 0.0000056 -0.4286564 -0.9601586 -0.2941925 -0.0000532 -0.2922566 -0.8939131 -0.0000438 -0.0000441 -0.0000246 -0.3360127 -0.0651493 -0.3332058 -0.0000245 -0.3983003 0.1166785 -0.0000198 -0.0000287 -0.0000185 -0.0500866 0.4683486 0.0838988 0.0000514 0.098888 -0.0057158 0.0000109 0.0000861 0.0000191 -0.0267918 0.1162218 0.2031291 0.0000334 -0.1194978 -0.0415878 0.0000022 0.0000057 0.0000179 -0.1344408 -0.8148798 -0.0920864 -0.0000591 -0.1230589 -0.050255 -0.0000061 -0.0000624 -0.0000069 0.0058454 -0.3228257 0.0812581 -0.0000036 0.1860541 0.0887525 0.0000375 0.0000029 0.0000298 -0.1742309 0.1693537 -0.0594537 0.000015 0.1807676 -0.0058385 0.0000192 0.0000199 -0.0000011 -0.1194824 -0.0533692 0.1423145 0.000002 0.0852285 -0.0294354 -0.0000008 -0.0000129 0.0000062 0.0653541 -0.2288342 -0.0324358 -0.0000284 0.0711034 0.0947844 0.0000016 -0.0000887 -0.0000163 0.0544441 2.1441084 -0.0073611 0.0001255 -0.0785678 1.3495958 0.0000309 0.0001118 0.000038 0.2274094 0.1080171 -0.0444714 -0.0000062 -0.028822 -0.022101 -0.0000166 -0.000006 -0.0000152 0.1502685 0.0332523 -0.0895294 -0.0000121 -0.0759699 -0.0905698 -0.0000251 -0.000008 -0.0000239 0.1499452 0.0670938 0.069379 -0.0000005 0.0691498 0.0256073 -0.0000063 0.0000009 -0.0000034 0.1610659 0.0291485 -0.1535942 -0.0000235 -0.0363516 -0.0788237 -0.0000234 -0.0000089 -0.0000312 0.111709 -0.0163354 0.0497964 -0.1108802 0.0192384 0.0587011 -0.0387025 -0.1325057 0.0212212 -0.0442225 -0.016387 0.049776 0.1108987 0.0191966 0.0587028 0.0387291 0.132518 -0.0211892 -0.0441693 -0.0156584 0.0110677 0.0547491 0.0305029 0.0608657 -0.1023713 0.1122556 -0.0691718 -0.0387156 -0.015644 0.0110347 -0.0547515 0.0304573 0.0608998 0.1023515 -0.1122374 0.0691578 -0.0387782 0.0689083 0.0074077 -0.0000023 -0.1105303 -0.1422431 0.000016 0.0000137 0.0000169 0.111385 0.2197273 -0.0911387 -0.00001 -0.1786265 0.2533062 -0.0000149 -0.0000068 -0.0000104 0.3981606 unknown
polarizability: 152.5452695|0.5466933|110.9317668|0.0067174|0.0042175|50.9739845 unknown
InChI: InChI=1S/C9H10O2/c1-6-3-4-8(9(10)11)5-7(6)2/h3-5,10H,1-2H3
charge 0 multiplicity 1
21 atoms
O  3.183937 -0.988192 0.000208
O  2.938057 1.31961 0.000266
C  -1.348318 0.807672 0.000035
C  -1.865023 -0.52809 -0.000103
C  0.049393 1.000079 0.000137
C  0.946389 -0.099456 0.00011
C  -0.95925 -1.619355 -0.000133
C  0.435049 -1.420537 -0.00003
C  -2.286035 2.001237 0.000058
C  -3.360536 -0.777565 -0.000233
C  2.402725 0.182722 0.000222
H  0.470693 2.0116 0.000241
H  -1.359137 -2.640091 -0.00024
H  1.128033 -2.266077 -0.000049
H  -1.724415 2.949953 0.000206
H  -2.947622 1.998641 -0.887654
H  -2.947808 1.998468 0.887629
H  -3.846254 -0.326601 0.886593
H  -3.846058 -0.326794 -0.887268
H  -3.58828 -1.856461 -0.000148
H  4.14286 -0.723962 0.000255
