program: Gaussian 09
title: 000130092
version: EM64L-G09RevD.01
frameworkgroup: C1[X(C9H14O8)]
method: RPBEPBE
basis: SDD
operation: Freq
keyword: #pfreq=noraman
keyword: PBEPBE/SDD
title: #p freq=noraman PBEPBE/SDD
converged: YES YES NO NO
title: Mulliken charges:
elementType: O O O O O O O O C C C C C C C C C H H H H H H H H H H H H H H
charge: -0.262906 -0.294279 -0.241190 -0.445791 -0.440341 -0.408212 -0.403786 -0.237425 -0.133736 -0.058491 -0.142032 -0.154022 -0.113663 -0.351362 0.257214 -0.695845 0.214867 0.251030 0.274329 0.272694 0.227405 0.246466 0.231057 0.248589 0.357699 0.227761 0.242418 0.242804 0.356507 0.351362 0.380880
chargesum: 0.00000
title: Mulliken charges with hydrogens summed into heavy atoms:
elementType: O O O O O O O O C C C C C C C C C
charge: -0.262906 -0.294279 -0.241190 -0.088092 -0.083834 -0.056850 -0.022906 -0.237425 0.117294 0.215838 0.130661 0.073382 0.132802 0.128284 0.257214 0.017138 0.214867
polarizability: 1.37710723e+02 2.45462899e+00 1.15772157e+02 -6.36652846e+00 6.94232238e+00 1.07532603e+02
1716.lowfreq: 0.0009 0.0009 0.0010 1.1436 7.3456 9.7207 30.3714 34.0154 43.5093
frequency: 30.3336 33.9430 43.4618 52.9343 98.2303 103.9460 147.0177 180.3521 196.6938 213.3405 232.4677 244.4848 265.3984 289.8655 313.6057 337.5448 347.7533 356.3527 363.8839 383.9301 398.3149 467.9424 490.6645 512.4089 550.0370 571.4244 599.1459 609.7191 628.0923 664.9426 698.3136 724.0607 739.9025 788.6831 815.2633 873.7085 888.6719 929.8119 948.2222 963.7971 981.5715 993.2234 1024.2588 1032.4915 1038.8883 1057.5062 1067.4239 1099.1834 1104.2995 1129.6840 1154.1285 1176.1000 1189.7360 1211.4541 1223.1788 1230.6876 1243.9720 1257.5466 1273.9393 1301.0449 1306.4253 1321.4952 1323.0045 1340.8112 1347.6987 1379.3147 1388.1885 1398.1267 1415.8920 1458.2321 1460.7669 1465.4552 1639.1767 2955.4409 3016.6151 3021.3852 3023.6284 3026.9993 3037.6319 3057.1745 3109.5014 3126.7925 3134.8263 3495.8200 3534.9980 3562.9531 3575.6177
redmass: 6.4589 5.9897 7.7845 6.2615 6.4442 5.3559 5.2192 3.6497 1.1181 3.8131 3.4277 4.3744 4.7477 2.9968 3.6578 2.1139 1.1411 1.6371 5.6007 3.5520 1.7736 4.3236 4.9514 3.5724 4.5883 4.8463 4.4238 1.4333 4.1235 3.8892 5.0498 6.1027 6.7137 3.1809 3.5440 3.3874 3.2794 5.4724 5.4482 5.3888 4.1885 3.1634 3.6211 3.0801 3.3809 2.5494 2.6112 2.8179 1.8571 2.6723 1.8755 1.2899 1.1063 1.2196 3.2332 1.2933 1.1709 1.2516 1.2459 1.2654 2.5823 1.2422 1.5310 1.6144 1.3996 1.5555 1.2391 1.2673 1.4405 1.0465 1.0556 1.0871 9.4202 1.0835 1.0849 1.0356 1.0777 1.0740 1.0788 1.0870 1.1076 1.1007 1.1006 1.0639 1.0647 1.0661 1.0661
irintensity: 1.7808 1.0226 0.1170 1.2925 1.5647 1.8567 6.3468 2.1949 0.7473 5.6679 3.4122 1.6654 3.0337 11.4838 16.8259 46.4172 104.6115 70.8998 1.4561 60.3089 228.9724 3.2275 14.0004 4.1772 13.6599 34.0901 28.9732 94.3610 15.0314 40.0592 5.6205 31.1270 10.0972 15.8836 53.1690 51.6283 66.7992 166.4829 93.3232 15.7363 51.7177 48.5302 111.4114 372.8798 8.2074 62.9190 56.7514 46.7348 39.2797 16.6198 14.7087 11.2200 7.3404 17.6351 59.5377 14.4206 12.2632 12.8059 3.3958 21.8799 35.5733 1.1876 7.4657 4.2487 0.4336 4.9188 40.6639 33.3762 1.3686 9.1895 13.6091 9.4479 159.3357 32.8915 4.2729 4.8643 18.1784 4.4339 52.1124 31.0986 11.1127 11.0001 10.5771 23.9525 10.8407 11.3080 13.4698
temp: 298.150 k
press: 1.00000 atm
elementType: 8 8 8 8 8 8 8 8 6 6 6 6 6 6 6 6 6 1 1 1 1 1 1 1 1 1 1 1 1 1 1
symmnumber: 1
zpe: 620939.4 jmol-1
zpe.correction: 0.236503 hartree
zpe.thermalcorrener: 0.253883 hartree
zpe.thermalcorrenthalpy: 0.254827 hartree
zpe.thermalcorrgfe: 0.190466 hartree
zpe.sumelectzpe: -951.755312 hartree
zpe.sumelectthermal: -951.737932 hartree
zpe.sumelectthermalent: -951.736988 hartree
zpe.sumelectthermalfe: -951.801349 hartree
dipole: -0.9701 0.8755 -0.7429
dipole: 1.5031
quadrupole: -79.3524 -107.8238 -96.3952
quadrupole: 0.2516 -5.0542 1.2736
quadrupole: 15.1714 -13.3000 -1.8714 0.2516 -5.0542 1.2736
hfenergy: -951.9918148 hartree
pointgroup: C01 [X(C9H14O8)]
dipole: 0.3619689 0.4561968 0.1028454 debye
polarizability: 138.226156|-3.8332679|107.8199165|-3.7204735|-7.5353193|114.9694105 unknown
InChI: InChI=1S/C9H14O8/c1-9(8(13)14)15-2-3(17-9)6-4(10)5(11)7(12)16-6/h3-7,10-13H,2H2,1H3
charge 0 multiplicity 1
31 atoms
O  1.628156 -1.165764 -0.736394
O  -0.755474 0.223056 0.340073
O  -1.882949 -1.547274 -0.68914
O  2.359347 2.314525 -1.106469
O  3.422558 1.008277 1.639989
O  3.340438 -2.091492 0.634103
O  -4.256428 0.158896 0.956796
O  -3.226392 1.1551 -0.868184
C  1.173597 0.189164 -1.162388
C  -0.351717 0.292933 -1.095531
C  1.904874 1.21585 -0.257327
C  3.030831 0.391654 0.380687
C  2.40106 -1.015526 0.520286
C  -1.117441 -0.882057 -1.776481
C  -1.977403 -0.5773 0.412927
C  -2.040275 -1.310786 1.738748
C  -3.184682 0.347782 0.087858
H  1.503825 0.339329 -2.207653
H  -0.673173 1.268474 -1.50472
H  1.242956 1.577077 0.553939
H  3.885344 0.327838 -0.32995
H  1.750524 -1.094168 1.409415
H  -1.811974 -0.509628 -2.548736
H  -0.440802 -1.651084 -2.179376
H  2.722741 3.030787 -0.527473
H  -2.069058 -0.593674 2.574785
H  -2.943478 -1.938039 1.785184
H  -1.145023 -1.946649 1.825152
H  4.109711 0.446017 2.079657
H  3.823439 -2.185352 -0.228502
H  -5.014531 0.743333 0.679226
