program: Gaussian 09
title: 000130098
version: EM64L-G09RevD.01
frameworkgroup: C1[X(C16H12FNO6S)]
method: RPBEPBE
basis: SDD
operation: Freq
keyword: #p
keyword: freq=noraman
keyword: PBEPBE/SDD
title: #p freq=noraman PBEPBE/SDD
converged: YES YES NO NO
title: Mulliken charges:
elementType: S F O O O O O O N C C C C C C C C C C C C C C C C H H H H H H H H H H H H
charge: 0.981482 -0.191092 -0.258256 -0.528775 -0.508672 -0.218750 -0.414074 -0.216671 -0.262191 -0.134297 0.181734 -0.332061 0.198032 -0.213279 0.078900 0.225565 -0.345097 0.173818 -0.432414 -0.637371 -0.504771 -0.313229 0.335237 -0.352489 0.224738 0.324309 0.297304 0.278652 0.309851 0.239350 0.272491 0.294633 0.206423 0.309666 0.272912 0.270827 0.387564
chargesum: 0.00000
title: Mulliken charges with hydrogens summed into heavy atoms:
elementType: S F O O O O O O N C C C C C C C C C C C C C C C C
charge: 0.981482 -0.191092 -0.258256 -0.528775 -0.508672 -0.218750 -0.026510 -0.216671 -0.262191 -0.134297 0.181734 -0.007752 0.198032 0.084025 0.078900 0.225565 -0.066446 0.173818 0.116788 0.136177 -0.195105 -0.040317 0.335237 -0.081662 0.224738
polarizability: 3.64145274e+02 4.22204464e+00 2.22741306e+02 1.91536259e+01 -1.42249617e+01 1.41393219e+02
1716.lowfreq: -6.8282 -3.0792 -0.0002 0.0014 0.0020 3.6379 15.8162 24.7495 32.4515
frequency: 15.7585 24.7059 32.3486 41.0409 59.8387 80.9797 87.8460 96.0033 136.3649 151.1462 159.1941 178.5142 186.7197 197.0207 201.7260 240.6644 243.0933 253.1137 279.8994 302.6154 319.1228 344.6889 358.7051 369.6835 380.6918 397.4447 414.9037 425.1310 446.6615 459.9792 472.6692 499.6081 510.6357 527.6755 545.4937 548.2006 568.8108 617.2309 618.9862 646.1047 653.0076 683.9578 698.7564 723.5755 749.7596 798.4027 806.7405 827.3453 834.7361 843.7062 848.9723 862.1995 895.4200 913.6239 952.2365 953.6866 960.4664 975.5784 982.4758 991.4277 1033.9850 1047.2524 1087.0106 1093.9414 1115.1916 1133.8357 1135.9588 1164.6116 1203.5843 1205.1121 1210.8558 1236.5976 1250.1974 1262.5366 1268.8352 1272.0069 1364.3593 1399.2314 1403.2328 1413.8277 1416.5340 1436.0192 1438.2228 1439.6154 1463.5722 1464.2025 1477.0158 1556.0384 1570.7674 1597.2830 1604.5150 1630.8364 1680.7203 2900.1308 2922.6114 3040.9797 3055.2201 3104.5513 3152.9525 3156.4199 3170.3191 3175.1516 3178.7539 3188.9442 3521.5003
redmass: 8.1810 7.8478 7.7486 11.4891 4.3377 5.9006 8.1828 5.1707 5.7689 6.3857 6.8345 8.7297 8.2391 5.0030 7.6735 1.3465 3.5133 5.3683 5.8168 4.6155 6.9607 6.9147 7.0146 7.7972 7.3522 7.5583 3.6046 9.4135 8.1451 3.2839 6.4627 1.9789 11.1438 3.8307 4.1125 6.2715 4.6912 2.2347 5.9210 2.4716 7.1164 5.1302 7.6822 4.0915 7.2757 3.8082 15.5260 1.5259 4.9001 1.6310 4.5401 7.1362 3.9841 1.4830 1.4162 1.3982 9.5116 3.7183 1.3757 1.9179 2.4810 2.0076 2.5612 1.3830 1.6122 1.5338 1.5806 2.1394 3.7281 4.3444 1.9847 5.7407 1.4116 1.6643 1.9584 1.2424 1.5938 8.9731 8.4745 1.1551 5.9937 4.1116 1.3377 1.9866 1.1027 2.6834 1.0504 8.4160 8.7269 9.3952 7.7253 7.9532 8.6186 1.0674 1.0469 1.0890 1.0853 1.1001 1.0922 1.0897 1.0892 1.0929 1.0967 1.0981 1.0642
irintensity: 0.4921 1.0542 0.3679 0.5422 1.6855 3.2553 0.4896 1.2629 3.3958 0.3188 2.5795 0.4635 3.5824 3.1343 0.0844 3.3285 1.2239 7.2995 0.8142 7.1306 2.6015 14.6170 19.9125 1.3572 2.9992 8.5338 1.4489 52.2448 112.0397 0.2336 21.0961 24.4198 0.8545 23.5079 21.8171 22.3576 21.2017 127.0560 0.8388 76.4086 2.8453 2.9380 5.0838 0.3105 30.5899 2.3058 79.1316 61.2679 31.3833 48.8974 51.8732 3.5433 47.6202 18.4365 3.3175 5.3096 51.8625 1.7822 2.0329 17.9825 361.7716 37.5844 8.2474 9.1900 38.2653 27.6947 24.9214 40.6637 43.4217 8.9708 9.2926 13.4274 5.6903 27.4969 273.4345 6.7767 102.1333 9.1837 10.8628 26.9033 5.1356 84.6405 119.5283 205.5551 37.8567 138.9616 33.5281 66.4910 95.8905 65.2814 49.5326 3.0962 214.7050 46.5927 51.5328 12.7235 7.4709 1.5327 8.6163 4.1122 0.9949 7.4696 2.1295 0.9526 35.6682
temp: 298.150 k
press: 1.00000 atm
elementType: 16 9 8 8 8 8 8 8 7 6 6 6 6 6 6 6 6 6 6 6 6 6 6 6 6 1 1 1 1 1 1 1 1 1 1 1 1
symmnumber: 1
zpe: 664179.5 jmol-1
zpe.correction: 0.252973 hartree
zpe.thermalcorrener: 0.275898 hartree
zpe.thermalcorrenthalpy: 0.276842 hartree
zpe.thermalcorrgfe: 0.198564 hartree
zpe.sumelectzpe: -1618.945776 hartree
zpe.sumelectthermal: -1618.922850 hartree
zpe.sumelectthermalent: -1618.921906 hartree
zpe.sumelectthermalfe: -1619.000184 hartree
dipole: 3.6054 7.1710 3.6367
dipole: 8.8118
quadrupole: -156.8825 -153.3336 -158.5881
quadrupole: -0.1527 -19.0898 -1.3391
quadrupole: -0.6144 2.9344 -2.3200 -0.1527 -19.0898 -1.3391
hfenergy: -1619.1987482 hartree
pointgroup: C01 [X(C16H12F1N1O6S1)]
dipole: -1.3970699 2.7889378 -1.5128995 debye
polarizability: 364.0507986|-4.6914572|223.5548018|19.5493323|11.7100273|140.6741979 unknown
InChI: InChI=1S/C16H12FNO6S/c1-18(8-15(19)20)25(22,23)10-3-5-14-12(7-10)16(21)11-6-9(17)2-4-13(11)24-14/h2-7,19H,8H2,1H3
charge 0 multiplicity 1
37 atoms
S  3.078775 -0.665488 1.362413
F  -6.9008 -1.057683 -1.131643
O  -2.347248 1.829583 0.32072
O  3.889695 0.451078 2.226149
O  2.850462 -2.197249 1.837106
O  -1.984502 -2.33777 -0.1294
O  6.10826 1.757196 -1.890892
O  6.176352 -0.55605 -2.126908
N  4.013322 -0.787277 -0.265755
C  1.364161 0.077053 1.016704
C  -0.959175 -0.212246 0.406791
C  0.319248 -0.775497 0.660542
C  -1.11962 1.195769 0.542276
C  1.213436 1.475879 1.160642
C  -2.100188 -1.081858 0.014223
C  -3.381718 -0.362004 -0.201077
C  -0.049054 2.040663 0.920089
C  -3.46235 1.048657 -0.042535
C  4.398718 0.541657 -0.759762
C  3.377174 -1.719334 -1.218536
C  -4.55234 -1.074516 -0.571452
C  -4.669592 1.753134 -0.242493
C  -5.73675 -0.362937 -0.764983
C  -5.823942 1.040404 -0.608267
C  5.641208 0.459555 -1.6449
H  0.440667 -1.862451 0.594425
H  2.060924 2.087628 1.486769
H  -0.227191 3.113959 1.026974
H  4.642665 1.184758 0.106367
H  3.605832 1.05333 -1.356009
H  3.081871 -2.633551 -0.677926
H  4.151617 -1.993989 -1.955257
H  2.498692 -1.289652 -1.750424
H  -4.498361 -2.160126 -0.694756
H  -4.687134 2.837795 -0.109055
H  -6.778897 1.547295 -0.77166
H  6.906483 1.716386 -2.484401
