program: Gaussian 09
title: 000130096
version: EM64L-G09RevD.01
frameworkgroup: C1[X(C12H16N4O3)]
method: RPBEPBE
basis: SDD
operation: Freq
keyword: #p
keyword: freq=noraman
keyword: PBEPBE/SDD
title: #p freq=noraman PBEPBE/SDD
converged: NO YES NO NO
title: Mulliken charges:
elementType: O O O N N N N C C C C C C C C C C C C H H H H H H H H H H H H H H H H
charge: -0.433950 -0.260078 -0.223181 -0.057903 0.059553 -0.008104 0.015196 -0.458059 -0.241213 -0.364050 -0.329888 0.605873 -0.343991 -0.607538 -0.269050 -0.687621 0.213278 -0.284338 -0.009028 0.268750 0.213796 0.201438 0.243418 0.207718 0.183441 0.213829 0.205479 0.194868 0.251014 0.249829 0.225068 0.214892 0.208766 0.341112 0.260676
chargesum: 0.00000
title: Mulliken charges with hydrogens summed into heavy atoms:
elementType: O O O N N N N C C C C C C C C C C C C
charge: -0.092838 -0.260078 -0.223181 -0.057903 0.059553 -0.008104 0.015196 0.024486 -0.039776 0.087086 0.067382 0.605873 0.056356 -0.356525 -0.019221 -0.038894 0.213278 -0.023663 -0.009028
polarizability: 1.99863022e+02 -1.12970832e+01 2.13515359e+02 2.72048215e+01 -3.66956905e+00 1.28179200e+02
1716.lowfreq: -12.6765 -6.0660 -0.5218 -0.0006 0.0008 0.0009 7.9500 20.7923 31.4338
frequency: 5.7917 20.6590 31.1196 50.2060 66.0912 74.8974 81.7188 96.3618 109.9064 122.3103 142.0172 168.8572 215.4879 226.1909 240.0855 261.0518 284.3344 301.2249 323.7503 364.3964 375.4433 390.4082 391.7046 426.9918 433.7493 452.1588 487.5276 513.1325 550.2784 604.3711 613.4686 668.0560 698.1278 736.5962 741.6353 742.9922 784.7791 829.6519 848.4738 867.1284 886.8761 902.2521 905.5584 924.3385 964.5819 976.5724 983.4346 1022.2958 1049.9219 1069.2911 1107.6074 1113.1058 1119.6334 1153.6802 1176.0948 1195.4071 1213.7529 1237.6321 1248.6876 1265.2563 1284.4800 1286.5223 1295.0195 1305.5352 1324.3198 1338.2134 1345.1104 1350.5711 1363.7653 1373.2271 1395.7001 1408.2908 1432.0709 1438.6044 1453.9154 1468.1976 1476.5833 1478.3491 1487.5186 1537.4925 1547.0284 1640.2366 2012.2792 2967.2079 2968.3564 2971.6531 2976.8958 2978.7633 2979.1680 3012.7851 3038.4535 3052.0120 3064.5655 3073.6618 3079.6382 3140.3131 3152.1153 3175.0706 3538.8609
redmass: 5.2222 6.2192 2.5575 8.0506 2.0376 7.9285 6.5452 6.4242 2.3081 5.3453 5.4837 5.5428 4.8538 1.1491 4.2839 1.3019 2.9681 4.8950 4.2088 4.4549 2.9834 4.8288 7.4269 4.2011 3.9546 7.4922 3.9510 5.7940 4.7681 3.7456 5.0761 4.6620 5.5058 1.1834 3.0437 3.7056 1.2175 1.7507 5.1811 1.6459 4.2437 1.7597 2.2678 1.6315 4.3010 1.4976 2.3099 3.6216 2.6826 2.5018 2.6831 2.3422 2.1132 1.6656 1.5086 2.0455 1.3363 1.6159 2.0186 1.3587 1.4134 1.2293 1.1691 1.6886 1.8465 1.6855 1.3526 1.5400 1.8898 1.9400 1.2159 2.1211 1.3279 2.0609 1.0815 1.0725 1.0637 1.0422 1.0845 7.4413 8.3701 6.6777 13.8540 1.0639 1.0639 1.0753 1.0398 1.0611 1.0607 1.0980 1.0997 1.1018 1.0997 1.1010 1.0993 1.0927 1.0871 1.0975 1.0660
irintensity: 0.6007 0.5048 1.3447 0.9577 0.6098 1.5538 0.1122 6.8928 0.4474 1.6244 0.4121 1.7142 1.7020 0.2858 10.8351 124.4610 25.2651 1.0629 0.9590 0.2951 1.9239 0.2041 3.9441 8.3857 6.2621 6.8675 7.1549 7.2629 5.6347 6.9208 14.6273 14.7680 16.2397 6.2953 4.4752 7.5280 3.0459 52.2329 8.9392 35.5462 21.5104 16.2432 75.5397 14.3364 61.2641 9.0097 39.7747 22.3804 5.1129 2.0162 15.4794 14.7358 61.2526 18.1838 34.9984 11.5111 12.3888 10.6171 11.4098 3.6961 0.1001 2.3068 5.8571 9.8699 62.4536 21.7528 6.6439 24.0826 25.9639 16.9982 12.5219 45.9376 13.1741 8.5896 7.2114 2.5676 4.4498 14.0043 20.6292 53.6293 179.2907 121.0624 510.7467 16.3054 9.2807 57.7408 14.0661 50.9707 85.2188 3.2355 18.0106 9.5001 3.9455 85.6022 50.6775 5.8192 3.0095 4.8396 8.4745
temp: 298.150 k
press: 1.00000 atm
elementType: 8 8 8 7 7 7 7 6 6 6 6 6 6 6 6 6 6 6 6 1 1 1 1 1 1 1 1 1 1 1 1 1 1 1 1
symmnumber: 1
zpe: 712206.7 jmol-1
zpe.correction: 0.271265 hartree
zpe.thermalcorrener: 0.291367 hartree
zpe.thermalcorrenthalpy: 0.292312 hartree
zpe.thermalcorrgfe: 0.218568 hartree
zpe.sumelectzpe: -909.995050 hartree
zpe.sumelectthermal: -909.974948 hartree
zpe.sumelectthermalent: -909.974003 hartree
zpe.sumelectthermalfe: -910.047747 hartree
dipole: 8.7864 0.1546 4.1893
dipole: 9.7352
quadrupole: -122.0400 -110.8203 -120.0896
quadrupole: 3.8665 -0.2996 -4.8409
quadrupole: -4.3900 6.8296 -2.4396 3.8665 -0.2996 -4.8409
hfenergy: -910.2663151 hartree
pointgroup: C01 [X(C12H16N4O3)]
dipole: -3.1196777 -0.2741486 2.2050793 debye
polarizability: 189.0220631|-8.6179324|212.1207088|-38.4867471|9.3401465|140.414809 unknown
InChI: InChI=1S/C12H16N4O3/c1-2-3-6-16(15-19)8-12(18)9-4-5-11(17)10(7-9)14-13/h4-5,7,12,18H,2-3,6,8H2,1H3
charge 0 multiplicity 1
35 atoms
O  0.192396 2.052936 2.501895
O  -0.673322 2.42656 -1.877227
O  4.087916 -0.533226 -1.718893
N  -2.061132 1.313594 -0.479971
N  -1.65311 1.602911 -1.786175
N  2.388321 -2.387786 -0.60323
N  2.889543 -3.384196 -0.983415
C  -1.459878 1.98378 0.685128
C  -0.382035 1.162827 1.468559
C  -3.256721 0.453711 -0.395281
C  -3.027439 -0.920821 0.273064
C  0.779324 0.684625 0.62273
C  -4.305225 -1.790371 0.221434
C  1.00548 -0.668128 0.427328
C  1.681208 1.643439 0.018611
C  -4.114895 -3.164872 0.897391
C  2.118635 -1.095755 -0.373446
C  2.769892 1.260378 -0.742963
C  3.098393 -0.135886 -1.020334
H  -0.978058 2.907826 0.312067
H  -2.276318 2.258518 1.382407
H  -0.869626 0.289743 1.94986
H  -3.591868 0.309894 -1.438257
H  -4.05753 0.999454 0.145341
H  -2.725012 -0.791023 1.331923
H  -2.197654 -1.441748 -0.243459
H  -4.60559 -1.93549 -0.835577
H  -5.139628 -1.24868 0.71213
H  0.356925 -1.425061 0.882148
H  1.494456 2.708082 0.190499
H  -5.039459 -3.767529 0.846821
H  -3.309868 -3.741822 0.405163
H  -3.844737 -3.051519 1.964291
H  -0.52987 2.374485 3.101736
H  3.440285 2.00045 -1.1907
