program: Gaussian 09
title: 000130076
version: EM64L-G09RevD.01
frameworkgroup: C1[X(C11H12N2S)]
method: RPBEPBE
basis: SDD
operation: Freq
keyword: #p
keyword: freq=noraman
keyword: PBEPBE/SDD
title: #p freq=noraman PBEPBE/SDD
converged: NO YES NO NO
title: Mulliken charges:
elementType: S N N C C C C C C C C C C C H H H H H H H H H H H H
charge: 0.193848 -0.400778 -0.038616 0.141107 0.333584 0.360884 -0.417579 -0.411163 -0.234142 -0.839383 -0.823109 -0.163975 -0.483310 -0.172901 0.232257 0.232111 0.312502 0.225472 0.222283 0.249435 0.237811 0.279986 0.226581 0.217845 0.264137 0.255112
chargesum: 0.00000
title: Mulliken charges with hydrogens summed into heavy atoms:
elementType: S N N C C C C C C C C C C C
charge: 0.193848 -0.088276 -0.038616 0.141107 0.333584 0.360884 -0.185322 -0.179052 -0.008669 -0.129855 -0.098696 -0.163975 -0.219173 0.082211
polarizability: 2.16693501e+02 -2.14993075e+00 1.41123892e+02 6.96164225e+00 -1.02238334e+01 9.24291778e+01
1716.lowfreq: -0.7940 0.0015 0.0019 0.0022 4.7333 7.8241 40.2152 53.2093 75.9267
frequency: 40.1899 53.2073 75.9130 146.6559 167.1463 192.7810 209.7787 220.5079 236.1270 274.5035 308.3418 325.7200 437.9734 473.3394 503.0707 506.0494 515.4025 518.2928 542.5029 555.9736 585.4077 654.1324 687.6774 689.7815 720.9776 776.2536 800.9686 825.7131 834.1687 858.7028 897.9077 923.2494 973.5059 987.0818 1020.7858 1039.4138 1045.5443 1051.8964 1075.7321 1101.1913 1177.0613 1202.1066 1246.2870 1260.8725 1274.3852 1280.8528 1368.4614 1398.0922 1399.6935 1435.7813 1451.8732 1458.2869 1470.7984 1475.1602 1485.1305 1487.1847 1497.1939 1575.4559 1604.5134 1607.0853 2959.7834 2978.9657 3039.7572 3059.7893 3089.3328 3089.6935 3121.4935 3131.0584 3157.0679 3194.7845 3254.3161 3540.2456
redmass: 6.3008 4.8148 4.0523 3.5675 1.0793 1.1301 5.1095 3.9935 2.9825 3.8618 2.7123 3.1531 1.7910 3.2599 3.5436 3.2354 3.0790 4.8881 6.6936 4.6254 4.4460 6.8871 2.7630 1.6900 4.4237 1.2627 5.6544 4.9577 5.8200 1.3204 1.3107 2.5247 1.3387 1.6219 2.2402 1.6558 1.6927 1.5968 1.5849 1.6181 1.1727 3.3076 3.3061 1.6428 1.6582 2.6239 6.4229 1.2372 1.2593 2.0594 1.8891 1.0995 1.1994 1.7270 1.7952 1.3246 1.6189 8.5316 5.9343 6.5930 1.0428 1.0365 1.0915 1.0967 1.0983 1.0994 1.0857 1.0919 1.0994 1.0921 1.1010 1.0757
irintensity: 0.3337 0.1660 0.2709 1.9260 1.8112 0.6041 4.2589 2.2628 4.2065 5.4090 4.9268 6.2138 47.5083 30.3406 28.4773 30.2867 3.5528 9.0871 3.4378 3.7274 36.1179 7.8299 28.4944 34.9882 6.8121 51.5025 14.8167 3.4451 2.0584 2.9214 0.3581 5.1457 0.1330 7.4370 58.5043 11.2274 3.2733 10.7385 11.1390 58.3435 1.9977 42.1568 18.3241 2.2773 1.2958 18.5117 17.1125 24.0607 5.2546 2.0074 32.9861 26.7069 7.1154 33.7394 91.9519 22.6843 46.1711 461.8032 2.5563 17.5805 34.2096 23.1857 19.2167 9.6803 18.1156 24.9756 0.6206 25.6650 34.9382 9.9513 1.4406 37.6933
temp: 298.150 k
press: 1.00000 atm
elementType: 16 7 7 6 6 6 6 6 6 6 6 6 6 6 1 1 1 1 1 1 1 1 1 1 1 1
symmnumber: 1
zpe: 536083.3 jmol-1
zpe.correction: 0.204183 hartree
zpe.thermalcorrener: 0.217448 hartree
zpe.thermalcorrenthalpy: 0.218392 hartree
zpe.thermalcorrgfe: 0.163997 hartree
zpe.sumelectzpe: -932.918404 hartree
zpe.sumelectthermal: -932.905139 hartree
zpe.sumelectthermalent: -932.904195 hartree
zpe.sumelectthermalfe: -932.958590 hartree
dipole: 0.2640 1.1908 -0.8506
dipole: 1.4870
quadrupole: -81.3240 -83.1462 -92.8284
quadrupole: 2.2105 -0.7938 -1.4772
quadrupole: 4.4422 2.6200 -7.0622 2.2105 -0.7938 -1.4772
hfenergy: -933.1225873 hartree
pointgroup: C01 [X(C11H12N2S1)]
dipole: -0.1062928 0.3538228 0.4536248 debye
dipolederiv: -0.4584584 -0.0148704 -0.0652118 -0.1551926 0.0058244 -0.1729731 -0.4027369 -0.1588736 -0.3006041 -1.7792053 0.1413555 0.1398277 0.1620344 -0.328838 0.0701007 0.3429336 0.0258315 -0.3973491 -0.7430122 0.0001658 -0.044326 0.2681437 -0.3251032 -0.2307559 0.4879386 -0.2440944 -0.744225 0.9982622 0.0204265 0.130382 0.2481185 -0.0406275 -0.0330754 0.4678253 -0.0433643 0.0174875 -0.1427518 0.0884561 0.0319111 0.0564884 0.2103818 0.0776689 0.0242961 0.0977507 0.0018501 -0.0112402 -0.1847522 0.0356757 -0.2316047 0.1899944 -0.0575191 -0.1438247 -0.0159731 -0.0207669 -0.0628772 -0.121396 0.0264169 -0.0714137 -0.0651332 -0.0050268 0.0675164 -0.0303944 -0.1802518 -0.0397943 0.1338404 0.0451499 0.0381887 0.0008617 0.0548593 0.0350409 0.0905648 -0.1549828 0.0020272 0.0055618 0.0799807 0.029801 0.0101055 0.0280928 0.0579596 0.0284565 -0.1085436 0.0018638 -0.0848267 -0.0173035 -0.0544455 -0.0685182 -0.0299449 0.003559 -0.0666979 0.0784509 -0.0991187 0.1598955 0.0024413 0.0928879 -0.0559193 0.0085889 0.0279409 -0.0299803 0.0158606 1.9348551 -0.0542999 0.0283909 -0.4828448 0.1590956 0.2892509 -0.4754503 0.3035714 0.7557899 -0.3363743 -0.0302747 -0.0879093 -0.0274799 -0.2571299 0.2300304 -0.0526626 0.2128352 0.1239356 0.5315705 -0.0444661 -0.0663604 -0.084608 -0.0375365 0.0882729 -0.1263263 0.0873448 0.1064788 0.0056656 0.0901146 -0.0273173 0.1275901 -0.0641259 0.0072503 -0.0412504 -0.0055275 0.1428967 0.0574349 -0.0347962 -0.031312 -0.0841025 -0.0984096 -0.0538483 -0.032629 -0.0458271 0.133792 0.0783099 -0.033645 -0.0367689 0.0686517 0.2353613 -0.0945501 -0.1678187 -0.0667579 0.2282388 -0.1123431 -0.0194671 -0.0928836 -0.0214618 0.0794404 -0.0173957 -0.0991614 -0.0224208 0.1223009 0.0941535 -0.0404778 -0.0658555 -0.015548 0.0181087 0.0006624 -0.0615985 -0.0784601 -0.1484383 -0.050198 -0.0941642 0.0741257 -0.0582605 0.0484816 -0.0140521 0.0870032 0.0153854 0.0504281 -0.0363634 0.1620016 -0.0409742 0.0690964 -0.0255001 0.0165595 -0.0605584 0.0664091 0.0917595 0.0504344 0.0791292 0.0727202 0.0932179 0.0926668 0.0229915 0.0788435 -0.0186372 0.0265615 0.0477437 0.0318786 -0.0960256 0.0466742 0.0570315 -0.0459715 -0.1045307 0.0403989 -0.0633664 -0.0225697 -0.1656897 -0.0089699 -0.078303 -0.0989479 0.0116094 -0.0223403 0.0023427 0.1101685 0.0012366 0.0120076 0.0180236 0.0215347 0.2139982 -0.063051 0.023078 -0.0591421 0.1151763 0.0907495 -0.0017071 -0.0038278 0.0428374 0.1444373 -0.0877741 0.086953 -0.0847402 -0.0026477 unknown
polarizability: 215.1584184|-6.3644669|131.3651922|14.5337894|21.4303514|103.7229607 unknown
InChI: InChI=1S/C11H12N2S/c1-8-4-3-5-9(2)10(8)13-11-12-6-7-14-11/h3-7,13H,1-2H3
charge 0 multiplicity 1
26 atoms
S  3.266478 0.398456 1.177633
N  0.477785 0.385249 0.898908
N  1.826567 -0.492463 -0.917622
C  -0.841431 0.169803 0.360395
C  -1.694909 1.307872 0.238587
C  -1.291505 -1.140846 0.02728
C  -3.011705 1.117361 -0.240349
C  -2.612331 -1.280273 -0.468154
C  -3.468875 -0.168002 -0.6037
C  -1.198692 2.696607 0.602947
C  -0.416237 -2.361117 0.213986
C  1.668178 0.058115 0.277065
C  4.103982 -0.275615 -0.278704
C  3.18288 -0.679862 -1.223662
H  -3.673576 1.98536 -0.342059
H  -2.971442 -2.281825 -0.732363
H  0.545781 1.013647 1.701131
H  -4.487945 -0.301971 -0.982758
H  -1.045907 2.817254 1.695302
H  -0.235647 2.924575 0.10972
H  -1.928854 3.463779 0.295969
H  0.353188 -2.409512 -0.578392
H  0.125108 -2.325174 1.177354
H  -1.017917 -3.285141 0.183924
H  5.189921 -0.31078 -0.312128
H  3.441406 -1.119299 -2.188109
