program: Gaussian 09
title: 000130058
version: EM64L-G09RevD.01
frameworkgroup: C1[X(C12H17NO2)]
method: RPBEPBE
basis: SDD
operation: Freq
keyword: #p
keyword: freq=noraman
keyword: PBEPBE/SDD
title: #p freq=noraman PBEPBE/SDD
converged: YES YES NO NO
title: Mulliken charges:
elementType: O O N C C C C C C C C C C C C H H H H H H H H H H H H H H H H H
charge: -0.274744 -0.268896 -0.147453 -0.039497 -0.435625 0.454350 -0.696286 -0.697412 -0.661225 -0.469976 0.192139 -0.371225 0.155043 -0.350064 -0.205138 0.233474 0.218861 0.208185 0.192935 0.218073 0.233271 0.203167 0.219952 0.212742 0.224268 0.230418 0.224090 0.254480 0.240900 0.241770 0.223112 0.236312
chargesum: 0.00000
title: Mulliken charges with hydrogens summed into heavy atoms:
elementType: O O N C C C C C C C C C C C C
charge: -0.274744 -0.268896 -0.147453 0.193977 -0.008579 0.454350 -0.052007 -0.061551 0.017551 -0.215496 0.192139 -0.130325 0.155043 -0.108295 0.254286
polarizability: 2.00650200e+02 -1.15105233e+01 1.46873549e+02 7.85639519e+00 6.05866014e+00 9.16982364e+01
1716.lowfreq: -11.0956 0.0005 0.0006 0.0007 4.2386 8.2322 33.7546 48.1001 60.6198
frequency: 33.4843 48.0607 60.6018 88.8096 124.8511 146.5374 197.7724 202.7902 212.3254 241.9702 251.0559 257.0122 293.0653 333.3070 338.4512 372.1842 414.1779 423.7341 434.9434 500.8767 547.9411 602.2665 613.5308 672.6357 694.3707 712.6552 776.0135 778.4901 804.1120 815.7893 835.9817 864.1830 894.4586 904.7625 914.0576 928.0622 957.7484 971.4006 988.0098 1048.2915 1075.4964 1083.3152 1108.9882 1133.7209 1135.4722 1139.2592 1170.1061 1179.0819 1207.8161 1233.2018 1262.1404 1288.5715 1297.7003 1341.6181 1353.8806 1358.1079 1365.9111 1375.1422 1383.9992 1394.4125 1442.2797 1456.3289 1462.3773 1468.6878 1471.8768 1477.6649 1482.2548 1486.3176 1488.2614 1499.5659 1510.1191 1608.0032 1643.7144 2932.0523 2962.6066 2965.4199 2969.4483 2977.3410 2987.8084 2990.6736 3027.2075 3055.8764 3064.7316 3072.4768 3080.6187 3098.5621 3111.2691 3164.2680 3184.6779 3191.6882
redmass: 3.8121 2.6929 3.6073 3.1243 2.5249 3.7069 2.1690 1.1144 1.6196 2.8336 1.2684 4.0734 2.3929 3.8834 3.8220 2.9308 2.9426 2.5290 3.4711 2.4152 4.8820 3.9430 4.1029 8.2374 3.3498 5.6662 1.5342 5.6182 2.6773 1.7752 6.0941 5.0905 1.4582 1.3197 1.2980 1.8338 1.4983 5.1650 2.3228 3.6444 1.5273 1.6381 1.2874 2.2054 1.2157 1.3402 1.6974 1.8936 2.3150 2.2959 1.7598 1.6455 1.2765 1.4851 1.3985 1.4434 1.7541 1.2292 4.8231 1.2184 1.1883 2.6055 1.0686 1.0643 1.0520 1.1619 1.0613 1.2605 1.1476 1.5095 1.4299 8.1851 8.0777 1.0385 1.0572 1.0377 1.0404 1.0644 1.0827 1.1006 1.1004 1.0987 1.0982 1.0989 1.0990 1.0940 1.1057 1.0882 1.0948 1.0917
irintensity: 0.0631 0.0703 0.5794 6.6867 9.2359 4.1860 0.3359 0.1687 0.5781 1.4510 0.3617 3.4597 0.6669 1.8921 3.8015 2.0544 5.4963 1.5462 2.0220 0.8862 1.9010 5.7593 4.3727 0.5412 4.2929 4.8825 38.9720 31.1675 5.3515 43.0893 39.4635 0.6253 13.8079 2.6170 5.8525 4.2365 1.6207 85.4245 89.2956 12.9116 11.5182 36.3548 1.0385 2.0456 8.4528 13.1584 12.3249 14.5503 229.2021 8.2418 56.1197 9.6395 1.0714 20.4358 20.8453 3.3645 13.4081 24.0064 8.8402 27.8223 28.4807 12.1474 6.7350 21.5780 4.5539 34.1503 6.4163 69.8348 46.8817 61.3611 227.9485 22.1916 123.5685 99.1029 27.1291 50.8706 46.9893 145.0070 8.9125 52.7543 22.7015 20.1867 61.8279 47.0126 52.7293 26.2979 34.1093 8.6322 11.1637 3.9289
temp: 298.150 k
press: 1.00000 atm
elementType: 8 8 7 6 6 6 6 6 6 6 6 6 6 6 6 1 1 1 1 1 1 1 1 1 1 1 1 1 1 1 1 1
symmnumber: 1
zpe: 702943.0 jmol-1
zpe.correction: 0.267737 hartree
zpe.thermalcorrener: 0.282946 hartree
zpe.thermalcorrenthalpy: 0.283890 hartree
zpe.thermalcorrgfe: 0.225018 hartree
zpe.sumelectzpe: -671.489218 hartree
zpe.sumelectthermal: -671.474009 hartree
zpe.sumelectthermalent: -671.473065 hartree
zpe.sumelectthermalfe: -671.531936 hartree
dipole: -2.4665 0.4007 -0.7848
dipole: 2.6192
quadrupole: -83.0072 -85.7889 -93.1320
quadrupole: -5.7001 -0.6414 0.2518
quadrupole: 4.3021 1.5205 -5.8226 -5.7001 -0.6414 0.2518
hfenergy: -671.7569547 hartree
pointgroup: C01 [X(C12H17N1O2)]
dipole: -0.9818453 0.1452312 -0.2769939 debye
polarizability: 201.3950124|-10.4624203|146.296995|4.2662099|7.3119592|91.5299783 unknown
InChI: InChI=1S/C12H17NO2/c1-9(2)7-13(3)10-4-5-11-12(6-10)15-8-14-11/h4-6,9H,7-8H2,1-3H3
charge 0 multiplicity 1
32 atoms
O  2.548615 -1.806316 -0.209415
O  3.927868 0.066797 0.366192
N  -1.601903 0.942729 -0.393756
C  -2.902173 -1.095632 0.452264
C  -2.472059 -0.193536 -0.743001
C  -0.221227 0.768915 -0.193299
C  -3.728341 -0.302933 1.489299
C  -3.688067 -2.3173 -0.077925
C  -2.18567 2.282748 -0.269396
C  0.386116 -0.52977 -0.337251
C  1.763566 -0.620762 -0.158428
C  0.612921 1.884054 0.144907
C  2.573767 0.484587 0.168421
C  2.014014 1.750537 0.332294
C  3.954154 -1.316998 -0.159125
H  -1.982344 -1.458973 0.953093
H  -1.973465 -0.820342 -1.510823
H  -3.38706 0.208198 -1.220701
H  -4.674103 0.064406 1.04349
H  -3.990251 -0.939113 2.354673
H  -3.162469 0.566749 1.868146
H  -4.614609 -1.996976 -0.593701
H  -3.981649 -2.987979 0.750009
H  -3.088096 -2.909021 -0.795344
H  -3.265769 2.229543 -0.477464
H  -1.731381 2.997877 -0.98683
H  -2.060713 2.702576 0.75068
H  -0.191118 -1.423795 -0.576911
H  0.175284 2.877449 0.263772
H  2.627486 2.615104 0.599699
H  4.363127 -1.311307 -1.189461
H  4.528648 -1.953714 0.529895
