program: Gaussian 09
title: 000130087
version: EM64L-G09RevD.01
frameworkgroup: C1[X(C16H20N6O)]
method: RPBEPBE
basis: SDD
operation: Freq
keyword: #p
keyword: freq=noraman
keyword: PBEPBE/SDD
title: #p freq=noraman PBEPBE/SDD
converged: YES YES NO NO
title: Mulliken charges:
elementType: O N N N N N N C C C C C C C C C C C C C C C C H H H H H H H H H H H H H H H H H H H H
charge: -0.361911 -0.128012 -0.062879 -0.298964 -0.146502 -0.055611 -0.104892 -0.381231 -0.386249 -0.381841 -0.370378 0.325490 0.250493 -0.613096 -0.685369 0.284531 0.367464 0.078244 -0.364903 -0.404958 -0.229737 -0.238614 -0.759860 0.234814 0.220510 0.256281 0.231031 0.208081 0.233679 0.192438 0.216859 0.260030 0.262835 0.223854 0.222746 0.190303 0.283635 0.239895 0.234477 0.232566 0.241638 0.237627 0.245486
chargesum: 0.00000
title: Mulliken charges with hydrogens summed into heavy atoms:
elementType: O N N N N N N C C C C C C C C C C C C C C C C
charge: -0.361911 -0.128012 -0.062879 -0.298964 -0.146502 -0.055611 -0.104892 0.074093 0.101063 0.059919 0.038919 0.325490 0.250493 0.023808 -0.162504 0.284531 0.367464 0.078244 -0.081268 -0.165063 0.004740 -0.006049 -0.035108
polarizability: 3.02327853e+02 1.02068373e+01 2.43774512e+02 9.19418192e+00 7.39822765e+00 1.47923049e+02
1716.lowfreq: -6.8794 0.0004 0.0005 0.0007 5.8233 7.6416 33.7611 43.2887 53.1160
frequency: 33.7091 43.2055 53.1134 68.8210 90.7340 104.4702 131.8002 144.7829 165.9156 184.6600 193.4673 210.6372 230.8980 251.1187 271.1319 296.7874 307.1328 325.3217 336.0182 354.2086 371.4582 384.5703 391.5912 423.6821 443.8620 455.9315 467.0663 495.7777 525.6615 551.4925 578.5877 592.7734 602.6392 638.8656 649.4216 666.9254 705.7023 729.4914 739.1392 767.0934 778.3844 798.5183 830.6321 831.7269 876.9535 893.8844 926.8387 935.4765 954.7239 967.4472 987.7405 999.4035 1000.1399 1021.3430 1032.0746 1039.5820 1045.2585 1050.3480 1063.2565 1070.3190 1082.5445 1102.2966 1127.5044 1143.5425 1145.9061 1153.7537 1167.0787 1170.8794 1191.2347 1199.2402 1212.3022 1230.7064 1269.6568 1277.2045 1285.5970 1290.0615 1305.9081 1311.7173 1324.1914 1342.3579 1344.9443 1359.0104 1368.8440 1387.6693 1397.6984 1402.2484 1430.8553 1440.9482 1449.6854 1450.9356 1451.4623 1454.5725 1457.6907 1462.0477 1464.3835 1473.2916 1476.3164 1482.2495 1492.1853 1503.6861 1561.4210 1590.9811 1609.9252 2852.5707 2864.6285 2904.7680 2978.5214 2982.0117 2998.3183 3010.0098 3018.7288 3027.8688 3032.1633 3076.4057 3080.1652 3099.2416 3104.0621 3118.7614 3121.8415 3129.3715 3143.3056 3162.4892 3181.3442
redmass: 4.3564 4.5731 3.7224 3.3290 1.2352 2.6994 4.9059 3.7292 3.5975 4.0384 3.6222 2.7179 1.4281 3.5494 3.4839 2.6551 2.9118 3.4133 2.3515 5.9828 3.1188 5.1972 3.7632 2.5027 5.4544 3.4647 2.8096 4.3564 5.4999 4.2139 5.0724 6.4277 2.5218 4.5998 4.8128 5.6247 5.1467 4.6837 3.4618 1.8109 2.7025 3.9792 3.4583 1.6594 1.5398 3.6888 2.0653 2.6875 1.5640 2.9446 1.3363 2.3823 2.5553 2.8171 3.0759 2.7774 1.7223 1.5215 1.7743 2.3329 2.9265 1.9924 1.6283 2.4696 2.4406 1.9927 3.6466 1.0854 2.1130 1.1932 2.3163 2.6122 1.5612 1.5935 1.7581 1.7762 1.5915 3.0845 1.2574 1.7702 1.4117 1.8002 1.4946 7.7663 1.3928 4.0190 1.1619 2.2567 1.1342 1.2059 1.7762 1.0801 1.0514 1.0661 1.1131 2.3848 1.1026 1.0566 1.9207 8.0456 7.1438 7.0326 6.8988 1.0664 1.0597 1.0672 1.0678 1.0679 1.0372 1.0689 1.0734 1.0882 1.0918 1.1009 1.0978 1.0949 1.0938 1.0995 1.0976 1.0870 1.0905 1.0966 1.0969
irintensity: 0.8833 0.8055 0.7270 0.6506 0.0802 0.8575 1.5074 2.8380 0.7289 3.6073 0.4992 2.2454 0.2157 2.8010 4.5031 11.9953 8.1055 3.4563 5.9518 5.4333 3.9968 2.7822 2.9912 2.8515 6.8597 6.1788 2.3401 0.5910 5.0159 1.3122 2.7501 3.8298 2.8796 2.1703 6.3675 3.0707 2.2240 4.3986 5.8454 60.8717 26.4916 1.7974 2.8127 1.1658 1.1227 21.0451 1.2941 12.2948 6.0396 19.2854 0.4307 17.1420 67.8421 17.3559 2.3390 22.8907 12.9210 3.6527 9.8066 3.6398 10.7522 15.3969 6.9519 53.8311 29.6676 35.2241 42.1088 2.2684 10.8418 7.6216 3.6609 0.5219 5.9185 18.1207 21.9807 32.2542 32.5935 23.0987 3.3284 46.8768 17.9292 8.6780 3.5363 0.8834 10.0040 4.3180 1.4554 6.0091 40.9206 23.3626 83.1205 1.5793 12.9113 58.3581 33.0873 37.1840 10.4140 7.7778 39.2415 55.6894 365.6449 8.9248 0.5380 47.6534 149.9689 52.0867 39.9057 11.6656 19.1326 17.5690 52.5022 51.4647 78.4750 31.3776 11.5016 16.1286 3.5797 9.2005 7.3456 1.9294 13.6095 25.5745 7.5946
temp: 298.150 k
press: 1.00000 atm
elementType: 8 7 7 7 7 7 7 6 6 6 6 6 6 6 6 6 6 6 6 6 6 6 6 1 1 1 1 1 1 1 1 1 1 1 1 1 1 1 1 1 1 1 1
symmnumber: 1
zpe: 914048.8 jmol-1
zpe.correction: 0.348143 hartree
zpe.thermalcorrener: 0.368213 hartree
zpe.thermalcorrenthalpy: 0.369157 hartree
zpe.thermalcorrgfe: 0.299866 hartree
zpe.sumelectzpe: -1023.659771 hartree
zpe.sumelectthermal: -1023.639701 hartree
zpe.sumelectthermalent: -1023.638757 hartree
zpe.sumelectthermalfe: -1023.708048 hartree
dipole: 0.7043 1.8677 -1.2636
dipole: 2.3624
quadrupole: -117.1773 -141.7138 -133.0026
quadrupole: 2.7087 0.4919 8.6680
quadrupole: 13.4540 -11.0826 -2.3714 2.7087 0.4919 8.6680
hfenergy: -1024.0079143 hartree
pointgroup: C01 [X(C16H20N6O1)]
dipole: -0.3006984 0.7939131 0.3783447 debye
polarizability: 301.6679382|-7.2659525|239.5541893|15.8147271|-20.6381459|152.8032868 unknown
InChI: InChI=1S/C16H20N6O/c1-12-17-15-11-13-5-3-4-6-14(13)22(23)16(21(15)18-12)20-9-7-19(2)8-10-20/h3-6H,7-11H2,1-2H3
charge 0 multiplicity 1
43 atoms
O  0.504986 -2.706643 -0.491947
N  -1.59056 -0.892612 -0.622953
N  -4.380616 -0.963316 0.063639
N  -0.023204 0.91261 -0.389924
N  0.730699 -1.373186 -0.310961
N  -0.939683 1.830585 0.191443
N  0.912159 2.932508 -0.682059
C  -2.579364 -0.149549 -1.43701
C  -2.164441 -2.084218 0.05175
C  -3.802116 0.241049 -0.582794
C  -3.370705 -1.648535 0.906741
C  -0.298778 -0.477983 -0.430493
C  1.068295 1.61177 -0.908306
C  -5.622569 -0.661364 0.800423
C  2.24808 0.887901 -1.47572
C  2.066903 -1.038039 0.183219
C  2.841793 0.010122 -0.379813
C  -0.320707 3.025068 -0.02322
C  2.609947 -1.898483 1.164367
C  4.154432 0.214069 0.107009
C  3.91847 -1.680177 1.636816
C  4.694135 -0.619045 1.109962
C  -0.91826 4.324163 0.416654
H  -2.907063 -0.813726 -2.262326
H  -2.116389 0.751606 -1.86779
H  -1.38863 -2.578275 0.653027
H  -2.500734 -2.801957 -0.719518
H  -4.57097 0.692788 -1.237657
H  -3.477606 1.00501 0.16343
H  -3.013591 -0.996084 1.744568
H  -3.834488 -2.55002 1.350168
H  2.976417 1.631899 -1.831183
H  1.937441 0.263433 -2.33754
H  -6.049562 -1.595855 1.206826
H  -6.364592 -0.218351 0.111945
H  -5.472985 0.050187 1.651675
H  1.998809 -2.731829 1.520185
H  4.756912 1.026406 -0.315412
H  4.334944 -2.336804 2.40793
H  5.714884 -0.450967 1.469443
H  -1.060554 4.998275 -0.446494
H  -1.89054 4.153989 0.905016
H  -0.2459 4.83858 1.125686
