program: Gaussian 09
title: 000130135
version: EM64L-G09RevD.01
frameworkgroup: C1[X(C21H20N6O4)]
method: RPBEPBE
basis: SDD
operation: Freq
keyword: #p
keyword: freq=noraman
keyword: PBEPBE/SDD
title: #p freq=noraman PBEPBE/SDD
converged: YES YES NO NO
title: Mulliken charges:
elementType: O O O O N N N N N N C C C C C C C C C C C C C C C C C C C C C H H H H H H H H H H H H H H H H H H H H
charge: -0.288752 -0.401813 -0.228731 -0.325758 -0.249750 -0.029151 0.011157 -0.147315 -0.366101 -0.007163 0.175576 -0.483466 0.270013 -0.374129 0.282599 0.007613 -0.366068 0.000498 0.158629 -0.386282 -0.366803 -0.329599 -0.692491 -0.133200 0.200322 -0.218725 0.166761 0.195378 -0.408701 -0.025628 -0.783885 0.200074 0.242611 0.226328 0.209313 0.248090 0.252036 0.260951 0.242576 0.295556 0.197773 0.220759 0.220801 0.300742 0.243599 0.293151 0.381253 0.242203 0.242040 0.265299 0.359810
chargesum: 0.00000
title: Mulliken charges with hydrogens summed into heavy atoms:
elementType: O O O O N N N N N N C C C C C C C C C C C C C C C C C C C C C
charge: -0.288752 -0.020560 -0.228731 -0.325758 -0.249750 -0.029151 0.011157 -0.147315 -0.006291 -0.007163 0.175576 -0.040782 0.270013 0.061512 0.282599 0.007613 0.134058 0.000498 0.158629 -0.125331 -0.124227 -0.034043 -0.053158 0.167543 0.200322 0.024874 0.166761 0.195378 -0.115550 -0.025628 -0.034343
polarizability: 4.97435720e+02 -1.54400831e+01 3.41261120e+02 5.52608407e+00 -1.08318722e+01 1.31651801e+02
1716.lowfreq: -8.9237 -5.5256 -0.0005 0.0005 0.0011 1.6447 10.2476 18.7005 24.5883
frequency: 8.5629 18.6068 24.4918 35.3995 37.1189 51.2551 59.2766 66.1405 79.2388 98.5787 113.7041 117.3301 131.9718 139.1228 142.7624 155.9745 180.2701 190.3057 211.8487 228.4656 241.4422 253.6149 277.7050 279.3323 284.1477 310.2729 340.5967 353.9887 362.7506 374.2016 379.0270 416.5584 434.4664 468.9892 490.9592 501.0747 510.0553 532.9365 552.8283 557.6521 589.5902 592.6441 600.4454 607.4573 631.7947 632.2804 643.8654 676.5952 697.8077 707.1849 722.2355 743.4469 748.7859 762.0004 775.1697 779.7443 790.7569 803.2942 812.7811 847.4244 870.2515 873.3390 887.0338 905.3915 908.2920 933.5761 934.5701 936.9658 946.1083 966.4156 977.9190 987.1557 987.7440 1000.7605 1015.8678 1028.9178 1035.0774 1049.8773 1068.0034 1093.0970 1093.7075 1107.2649 1118.9461 1126.3193 1133.0046 1134.0230 1173.2516 1194.9613 1196.3791 1202.4254 1220.3753 1226.9401 1234.0854 1257.7374 1269.1941 1284.3256 1292.5544 1305.7198 1322.6603 1338.3415 1342.4981 1351.1896 1364.4935 1384.4896 1388.5336 1401.8249 1410.8041 1413.4255 1416.8146 1418.8152 1447.7630 1453.4214 1460.1448 1462.6491 1467.5812 1468.8394 1473.1287 1476.6905 1482.5115 1485.4324 1543.3505 1557.2989 1575.2776 1583.4909 1622.8926 1634.1932 1657.5672 2663.6233 2969.8157 2975.4975 2985.4368 2992.0488 3001.4529 3031.5960 3032.2862 3061.1437 3072.5440 3076.2380 3078.2933 3128.1506 3149.2509 3159.7421 3174.0097 3177.8096 3187.5700 3198.9478 3609.6765
redmass: 5.1249 5.6133 5.0353 4.9960 8.5594 7.1278 3.8154 8.2835 1.6486 6.3612 4.9681 3.7758 1.1862 7.2179 3.6297 5.6703 7.2989 5.1991 4.0896 1.3906 2.3549 3.4382 4.0425 4.6119 5.6039 3.6261 4.1043 7.7405 6.3174 6.7984 5.9608 6.7071 6.4826 3.7099 6.6735 4.7051 4.8084 5.1337 4.5904 5.4572 4.5348 3.5704 5.2959 9.4673 5.4038 8.7917 3.5256 4.2904 6.1409 8.4749 1.1754 1.1488 7.9094 6.9897 7.0998 4.4192 1.5189 6.5564 1.4683 1.7386 6.1609 1.9657 5.1593 2.7394 5.5508 9.6730 1.3389 3.3511 1.3437 1.4270 1.0683 2.1921 1.3471 10.5574 1.6758 1.7222 2.5788 2.9257 2.1149 2.1789 5.4751 4.4423 2.4402 4.8047 3.7381 4.5254 1.3732 3.5386 1.6884 1.1160 2.4413 2.3676 1.5591 2.2355 2.4703 1.3153 1.2906 3.7077 2.4556 1.4987 1.4665 2.1483 1.8994 1.5974 1.2150 1.7499 3.4453 2.3672 3.7619 2.8849 1.4044 1.1429 1.1141 1.0482 7.1020 5.2448 1.0657 1.0770 2.0081 1.0858 5.8699 4.6688 6.7399 3.9468 6.1766 4.0803 11.6951 1.0741 1.0360 1.0563 1.0598 1.0377 1.0611 1.1043 1.0989 1.0998 1.1003 1.0970 1.1025 1.0992 1.0880 1.0930 1.0880 1.0953 1.0927 1.1003 1.0845
irintensity: 1.0096 0.1897 0.1837 1.1857 4.4391 1.1980 3.7992 2.7468 0.2162 1.7896 2.0302 0.3346 1.2162 0.6016 1.4736 0.8064 0.0709 0.8148 3.4707 2.5582 7.8363 7.1202 0.1093 0.2614 1.4331 2.0255 2.1214 2.7269 0.9943 8.8077 8.9763 5.2778 0.7163 0.0272 3.2872 0.2324 3.1380 5.1229 14.2245 2.4988 3.7081 1.3007 22.2339 6.3401 10.3246 10.1170 5.0789 2.3016 9.3081 1.3158 117.8792 7.6807 0.4724 2.9151 0.9371 50.9534 29.7651 17.9318 46.8431 11.9369 4.7200 11.7378 4.4014 19.9553 2.0227 8.6926 0.5193 25.8235 0.1132 10.7148 125.2226 8.6301 2.8183 11.5261 1.0650 2.8134 179.6591 2.5220 35.4133 9.0084 54.0240 75.9100 279.0448 17.7278 11.1680 11.3590 0.8194 6.2076 2.1692 0.9871 50.5718 118.8712 23.9785 80.2037 222.1701 35.0287 30.4918 7.6715 121.9252 7.0472 70.9456 48.8590 235.9951 220.1752 14.4241 108.9570 85.9690 23.7333 31.0119 10.0611 57.3782 59.7027 8.9545 21.0377 96.5898 431.0827 6.3474 19.1714 30.3545 15.7025 130.2977 27.3008 16.6962 59.0617 115.6055 377.1253 243.7092 452.1296 41.3822 16.8771 11.7884 2.3489 40.1681 10.4004 1.4426 23.7237 45.8082 9.9987 70.9609 15.0357 5.1695 2.3114 8.8658 8.8890 5.1897 3.8646 162.2733
temp: 298.150 k
press: 1.00000 atm
elementType: 8 8 8 8 7 7 7 7 7 7 6 6 6 6 6 6 6 6 6 6 6 6 6 6 6 6 6 6 6 6 6 1 1 1 1 1 1 1 1 1 1 1 1 1 1 1 1 1 1 1 1
symmnumber: 1
zpe: 1012562.1 jmol-1
zpe.correction: 0.385665 hartree
zpe.thermalcorrener: 0.413308 hartree
zpe.thermalcorrenthalpy: 0.414252 hartree
zpe.thermalcorrgfe: 0.323403 hartree
zpe.sumelectzpe: -1439.403489 hartree
zpe.sumelectthermal: -1439.375845 hartree
zpe.sumelectthermalent: -1439.374901 hartree
zpe.sumelectthermalfe: -1439.465750 hartree
dipole: 1.3357 0.1897 0.3094
dipole: 1.3841
quadrupole: -207.6868 -169.8903 -181.6987
quadrupole: 14.7424 -2.7933 -0.8954
quadrupole: -21.2615 16.5350 4.7265 14.7424 -2.7933 -0.8954
hfenergy: -1439.7891531 hartree
pointgroup: C01 [X(C21H20N6O4)]
dipole: -0.5345504 0.1021457 0.0192327 debye
polarizability: 486.4829558|-7.5319573|172.8477762|43.2911099|-86.2273443|311.0179093 unknown
InChI: InChI=1S/C21H20N6O4/c1-3-5-15-17(8-7-14(12(2)28)18(15)29)31-11-13-6-4-9-27-20(13)22-10-16(21(27)30)19-23-25-26-24-19/h4,6-10,25,29H,3,5,11H2,1-2H3
charge 0 multiplicity 1
51 atoms
O  1.293877 -0.500565 0.511776
O  5.990467 -0.741403 1.324351
O  -5.917226 -0.652788 0.415021
O  7.602119 0.276008 -0.312075
N  -3.552557 -0.56906 0.389651
N  -2.33188 0.407843 -1.466769
N  -7.297218 0.479211 -1.890638
N  -5.913324 1.348003 -3.523083
N  -7.97346 1.004778 -2.959347
N  -7.174006 1.537754 -3.963899
C  3.634661 -0.63178 0.902402
C  3.366412 -1.368887 2.198685
C  2.584886 -0.193048 0.058097
C  3.093012 -0.405335 3.389162
C  -1.108484 -0.504622 0.410663
C  4.964763 -0.330973 0.504867
C  0.152438 -0.092942 -0.313882
C  -2.349484 -0.207542 -0.253433
C  5.245736 0.385704 -0.721911
C  2.827481 0.51024 -1.160118
C  4.14665 0.788299 -1.531559
C  -1.115099 -1.131773 1.655366
C  2.808345 -1.170224 4.698737
C  -3.551711 -1.195518 1.631316
C  -4.893937 -0.297693 -0.226169
C  -2.358263 -1.481412 2.272008
C  -4.794659 0.358236 -1.513618
C  6.637369 0.666722 -1.0851
C  -3.529371 0.671871 -2.058591
C  -5.993709 0.707747 -2.268473
C  6.986877 1.413585 -2.358726
H  2.494905 -2.038317 2.071628
H  4.244987 -1.991031 2.444367
H  3.973202 0.251913 3.52306
H  2.235921 0.249776 3.138548
H  0.154392 1.003145 -0.474929
H  0.196169 -0.57357 -1.310717
H  2.005229 0.832035 -1.803276
H  4.333408 1.328958 -2.464848
H  -0.162793 -1.347422 2.144835
H  1.919788 -1.823266 4.59645
H  3.66505 -1.813022 4.974582
H  2.62253 -0.475501 5.53825
H  -4.546863 -1.422371 2.02075
H  -2.382019 -1.973259 3.247102
H  -3.489937 1.167337 -3.033385
H  6.876826 -0.435997 0.866446
H  6.540601 2.424884 -2.364034
H  6.61216 0.879513 -3.250971
H  8.081218 1.503972 -2.427269
H  -8.991277 1.004785 -3.014302
