program: Gaussian 09
title: 000130057
version: EM64L-G09RevD.01
frameworkgroup: C1[X(C15H15BrN6O)]
method: RPBEPBE
basis: SDD
operation: Freq
keyword: #p
keyword: freq=noraman
keyword: PBEPBE/SDD
title: #p freq=noraman PBEPBE/SDD
converged: YES YES NO NO
title: Mulliken charges:
elementType: Br O N N N N N N C C C C C C C C C C C C C C C H H H H H H H H H H H H H H H
charge: 0.061165 -0.243929 -0.151382 -0.012131 -0.134688 -0.042147 -0.110971 -0.412873 -0.555470 0.151539 -0.068838 0.559010 0.247907 -0.191273 -0.475219 -0.460296 0.472959 -0.194091 -0.385599 -0.452886 -0.643005 -0.627085 -0.070399 0.247106 0.277132 0.317307 0.234200 0.229265 0.241644 0.222610 0.312607 0.223784 0.219982 0.218982 0.222400 0.296738 0.304379 0.171567
chargesum: 0.00000
title: Mulliken charges with hydrogens summed into heavy atoms:
elementType: Br O N N N N N N C C C C C C C C C C C C C C C
charge: 0.061165 -0.243929 -0.151382 -0.012131 -0.134688 -0.042147 -0.110971 -0.108494 -0.031233 0.151539 -0.068838 0.559010 0.247907 -0.191273 -0.157912 -0.226095 0.472959 0.035174 -0.143955 -0.230276 0.113369 0.111036 0.101168
polarizability: 3.06207473e+02 -4.39926068e+01 2.02093955e+02 -2.10285258e+01 4.59335012e+00 1.82970445e+02
1716.lowfreq: -3.2185 -0.0007 -0.0005 0.0005 2.8188 7.5696 12.3036 18.2294 30.7588
frequency: 11.4453 18.0634 30.7164 56.7205 68.2684 75.7005 106.4797 117.5689 128.5545 135.7021 145.4643 158.0562 180.4396 194.1848 234.7378 245.9107 259.4494 272.2983 289.3744 328.7998 333.1742 344.6916 359.5497 370.8899 430.4873 447.7045 490.6656 502.6107 543.2768 556.0091 579.0433 610.2773 619.8289 641.2892 648.3220 667.8236 695.9375 704.4723 720.7178 760.2066 787.0438 796.5565 805.3574 835.1382 883.3563 902.6308 928.7383 934.2278 947.6992 951.8960 973.4339 985.8321 994.9467 1031.3945 1065.0156 1090.5922 1098.3175 1098.5818 1111.2802 1147.0733 1149.0957 1183.7638 1186.3686 1196.5281 1219.1250 1254.7760 1266.6228 1284.0238 1291.7523 1328.1947 1336.2170 1364.3891 1371.7325 1374.0524 1387.0458 1397.1225 1406.0850 1411.5471 1436.9079 1442.1135 1456.9650 1465.0285 1472.6415 1476.6083 1485.5313 1498.0530 1503.2849 1520.1744 1532.2614 1601.4998 1605.5197 1620.4874 1640.7347 2927.9360 2958.8613 2966.6291 2995.9853 3031.2279 3038.9754 3055.7108 3112.1121 3116.1189 3126.5784 3127.9567 3157.8076 3160.1327 3180.8739 3516.1171
redmass: 8.1468 6.1602 6.1571 4.6740 5.7563 3.7470 2.5274 7.0479 4.9399 1.0679 3.3316 2.4015 3.2892 6.1841 3.5815 4.9861 2.6772 6.8478 5.5358 5.2767 4.7116 3.0906 4.7398 3.3582 3.7629 3.4851 6.1506 4.4681 4.5888 4.2867 5.0348 6.0492 6.7985 9.6124 1.2041 10.7852 3.0785 3.2351 4.9981 4.8303 8.3625 2.0466 5.1820 9.3700 1.5113 3.2347 1.4281 1.6360 2.5921 1.8599 1.3556 5.7472 2.1868 3.4805 1.4530 2.2106 1.4487 3.1840 2.0506 3.0996 1.3667 1.1188 1.9905 2.5605 3.3530 2.6433 2.2443 5.0965 1.5749 3.7654 2.6645 1.7121 3.2346 1.5211 2.2763 2.9575 1.5522 2.0552 2.0507 1.7685 1.2355 1.2274 2.3468 1.2443 1.0454 1.0610 1.7898 2.1590 7.0656 5.0980 6.0958 5.5241 5.1105 1.0863 1.0361 1.0364 1.0603 1.1007 1.1014 1.1016 1.1000 1.0882 1.0970 1.0905 1.0986 1.0920 1.0929 1.0769
irintensity: 0.3293 1.2122 2.3973 0.7503 7.1060 0.4976 1.4774 2.9334 4.0840 0.5214 3.1690 2.9982 13.3662 4.5638 5.4142 2.0347 4.4468 1.3431 1.5237 2.4105 1.3374 6.7919 2.3946 6.8282 0.0333 6.1968 5.9934 0.5480 7.4697 1.4608 6.8122 1.7658 2.4307 9.3121 51.8690 1.1029 5.7098 28.6944 4.3563 63.7699 9.1873 23.0568 11.0228 7.5051 4.9619 4.7843 12.0801 10.2331 3.3663 5.8794 0.2610 1.3252 46.6089 85.4179 8.2137 15.6461 1.5185 6.5170 33.5143 70.9245 0.3801 10.0237 20.3201 69.3409 23.0633 16.3828 9.6077 50.5893 55.0612 169.8298 47.3746 24.5611 23.8860 1.0773 8.6581 16.1913 35.7543 90.5270 67.9195 58.0231 10.1800 36.4749 38.1699 54.8225 2.6988 39.4090 87.0679 131.3349 62.3441 612.6594 101.7105 47.1454 177.2546 132.8685 53.8946 198.4357 17.7480 45.3865 27.4611 9.2574 8.3916 8.9551 1.0010 16.9909 25.3611 22.6985 3.9028 13.3911
temp: 298.150 k
press: 1.00000 atm
elementType: 35 8 7 7 7 7 7 7 6 6 6 6 6 6 6 6 6 6 6 6 6 6 6 1 1 1 1 1 1 1 1 1 1 1 1 1 1 1
symmnumber: 1
zpe: 754205.4 jmol-1
zpe.correction: 0.287262 hartree
zpe.thermalcorrener: 0.308457 hartree
zpe.thermalcorrenthalpy: 0.309402 hartree
zpe.thermalcorrgfe: 0.233744 hartree
zpe.sumelectzpe: -996.152613 hartree
zpe.sumelectthermal: -996.131417 hartree
zpe.sumelectthermalent: -996.130473 hartree
zpe.sumelectthermalfe: -996.206130 hartree
dipole: -3.8896 0.0618 -1.4082
dipole: 4.1372
quadrupole: -104.4882 -141.0123 -140.4858
quadrupole: 10.0036 -1.0808 11.5162
quadrupole: 24.1739 -12.3502 -11.8237 10.0036 -1.0808 11.5162
hfenergy: -996.4398745 hartree
pointgroup: C01 [X(C15H15Br1N6O1)]
dipole: -1.4497024 0.433373 -0.5999479 debye
polarizability: 278.5537852|-64.0872184|230.7012786|-16.9481946|8.5506016|182.0168097 unknown
InChI: InChI=1S/C15H15BrN6O/c1-21(2)13-12-14(18-8-17-13)22(15(16)20-12)7-10-4-3-5-11(6-10)19-9-23/h3-6,8-9,19H,7H2,1-2H3
charge 0 multiplicity 1
38 atoms
Br 0.133509 3.502222 -0.914417
O  -1.509784 -2.089617 -1.891616
N  0.317621 1.169908 0.814072
N  2.017343 1.318347 -0.719571
N  4.285981 -0.965282 -0.722057
N  0.990265 -0.887251 1.995948
N  3.052589 -1.850793 1.088282
N  -3.66244 -1.112207 -1.785842
C  -0.909219 1.450638 1.574838
C  1.157717 0.066866 1.040495
C  2.206802 0.166132 0.082539
C  -2.199903 1.217137 0.792164
C  3.203916 -0.872428 0.12006
C  0.899027 1.86956 -0.252192
C  -2.286816 0.161196 -0.142992
C  -3.32353 2.037034 1.05077
C  -3.509007 -0.070445 -0.824669
C  -4.540984 1.795206 0.376652
C  1.996477 -1.810921 1.944955
C  -4.639245 0.749007 -0.559906
C  4.552315 -0.007126 -1.80882
C  5.24577 -2.075956 -0.600729
C  -2.714813 -2.018276 -2.250978
H  -0.874191 2.487789 1.953988
H  -0.865453 0.766637 2.444487
H  -1.428471 -0.480723 -0.352685
H  -3.248085 2.86281 1.768042
H  -5.41227 2.428835 0.573714
H  1.94858 -2.619863 2.680196
H  -5.58477 0.570984 -1.088114
H  3.797691 0.791673 -1.818503
H  4.537386 -0.530232 -2.785328
H  5.555574 0.442766 -1.675024
H  6.264901 -1.678597 -0.429545
H  5.254402 -2.675798 -1.531599
H  4.94651 -2.711513 0.244181
H  -4.595781 -1.200846 -2.197191
H  -3.156712 -2.704671 -3.010105
