program: Gaussian 09
title: 000130011
version: EM64L-G09RevD.01
frameworkgroup: C1[X(C5H9N7)]
method: RPBEPBE
basis: SDD
operation: Freq
keyword: #p
keyword: freq=noraman
keyword: PBEPBE/SDD
title: #p freq=noraman PBEPBE/SDD
converged: YES YES NO NO
title: Mulliken charges:
elementType: N N N N N N N C C C C C H H H H H H H H H
charge: -0.173388 -0.065968 -0.081227 -0.618550 -0.643169 -0.630263 -0.629388 0.004980 0.112579 0.102415 -0.378025 0.160485 0.232660 0.318256 0.333854 0.322576 0.323009 0.330881 0.301610 0.307781 0.368889
chargesum: 0.00000
title: Mulliken charges with hydrogens summed into heavy atoms:
elementType: N N N N N N N C C C C C
charge: -0.173388 -0.065968 -0.081227 0.033561 0.002416 0.002228 0.047282 0.004980 0.112579 0.102415 -0.145365 0.160485
polarizability: 1.55116430e+02 -1.70763190e-01 1.19551426e+02 -3.72629513e+00 -2.12151415e+00 5.78684751e+01
1716.lowfreq: -13.4418 -7.2203 -0.0006 -0.0005 0.0002 6.5785 18.9336 77.0606 110.1158
frequency: 12.3781 77.0572 110.1136 160.8950 209.4527 222.1793 259.6939 279.0130 321.8338 336.9680 386.0865 425.5075 468.2033 482.4725 515.6170 519.1013 534.3483 539.9226 546.3931 578.1522 593.6450 596.9656 654.4411 659.4306 717.2865 779.2239 845.0930 924.3165 934.6496 966.5744 981.7821 1023.8309 1086.7445 1139.9200 1244.9826 1310.9561 1317.8661 1332.0286 1420.8545 1442.4371 1480.0118 1522.6059 1529.6036 1587.4823 1601.8959 1606.7851 1622.7958 1666.0770 3151.8460 3524.9593 3530.8607 3540.0490 3545.1868 3677.7969 3681.8397 3693.8419 3697.4154
redmass: 3.2983 4.0449 4.7452 3.8735 1.4147 7.7643 1.8063 2.8571 2.0073 2.7662 2.5081 1.3200 1.5704 1.9519 2.2755 1.2942 2.1552 2.5283 2.8747 1.3271 1.2297 2.4066 9.2097 6.1696 6.5052 10.8375 7.6091 1.4315 5.0530 2.4573 2.0488 1.3928 1.7461 2.6571 3.2153 5.9412 2.7722 2.7913 2.2005 4.0649 3.1704 6.2943 3.1670 2.0772 1.3446 1.2433 1.4332 2.4271 1.0916 1.0443 1.0437 1.0448 1.0456 1.1033 1.1040 1.1035 1.1049
irintensity: 4.6495 0.4124 6.5886 1.1415 28.4687 1.5225 118.6811 40.9828 88.3929 90.6225 54.2123 133.6194 149.5478 70.3186 57.1856 104.7949 83.4926 46.9212 10.3551 93.2715 13.6308 44.4509 3.7882 42.7352 18.3518 7.4383 1.5385 13.5626 21.4040 23.5989 17.0896 5.9043 14.8063 18.8574 4.9070 54.1408 9.4162 11.8195 27.7911 150.5172 13.1421 13.6656 114.2522 606.5330 69.8107 212.8712 240.4865 735.5359 28.4423 55.0392 45.5624 55.5899 18.4908 29.0443 31.1966 28.4568 55.7448
temp: 298.150 k
press: 1.00000 atm
elementType: 7 7 7 7 7 7 7 6 6 6 6 6 1 1 1 1 1 1 1 1 1
symmnumber: 1
zpe: 428379.6 jmol-1
zpe.correction: 0.163161 hartree
zpe.thermalcorrener: 0.175261 hartree
zpe.thermalcorrenthalpy: 0.176205 hartree
zpe.thermalcorrgfe: 0.124450 hartree
zpe.sumelectzpe: -578.330209 hartree
zpe.sumelectthermal: -578.318109 hartree
zpe.sumelectthermalent: -578.317165 hartree
zpe.sumelectthermalfe: -578.368920 hartree
dipole: 7.3438 -0.1568 0.4362
dipole: 7.3584
quadrupole: -60.2978 -60.1954 -71.3915
quadrupole: -2.1216 3.0886 -1.2891
quadrupole: 3.6638 3.7662 -7.4300 -2.1216 3.0886 -1.2891
hfenergy: -578.4933703 hartree
pointgroup: C01 [X(C5H9N7)]
dipole: -2.8576308 -0.3602348 -0.2921765 debye
dipolederiv: -1.700392 -0.0691857 -0.0843059 -0.2841122 -0.3983903 -0.1365851 -0.2435012 -0.1149171 -0.5549652 -0.6117942 0.3147076 0.1292459 -0.0026412 -0.7414459 -0.1090741 0.0626572 -0.1953725 -0.2984396 -0.7412973 -0.2730985 0.0388039 -0.0620024 -0.7393008 -0.0721033 0.0897497 0.0030695 -0.2456782 -0.26369 0.4543145 0.0225366 0.1842118 -1.3152486 -0.2009205 -0.0619587 -0.1479884 -0.7126069 -0.3693767 -0.5635417 -0.1638281 -0.2424719 -1.1166625 -0.0203179 -0.1942426 -0.1609447 -0.5836444 -1.469193 -0.0280374 0.2940369 -0.1613957 -0.6416592 0.1117497 0.4684537 0.0866361 -0.3926377 -0.4540361 0.0601611 -0.0465013 -0.0493298 -0.5601536 -0.0920971 -0.3908845 -0.1582162 -1.1190749 0.8103976 -0.1143243 -0.0427369 -0.0767357 -0.8141837 -0.1804503 -0.1438945 -0.1652704 -0.0369293 0.3286994 -0.2970056 -0.1291978 -0.2078127 1.5173246 0.398859 -0.0323786 0.3969433 0.2867064 0.3841291 0.3681296 -0.0444698 0.3454794 1.3919997 0.0690546 -0.0532905 0.0803536 0.1032111 0.4708602 0.0271911 -0.1234146 0.1022852 0.7602583 0.1622524 -0.0985687 0.1755166 -0.0178569 2.2554631 0.0902734 -0.0234061 0.3701867 0.4108581 0.5477621 0.3764693 0.4282749 1.2097731 -0.126293 0.0124349 0.0494904 0.0110109 0.0838849 -0.0110917 0.0535158 -0.0118254 0.1130045 0.1672773 -0.0171743 0.0296355 -0.0037948 0.2720756 -0.029822 0.0349943 -0.0569646 0.3548316 0.2060056 -0.0340195 0.0367201 0.0279592 0.2807382 0.0055793 0.0472116 -0.0512276 0.3371376 0.146313 0.0409189 0.0773956 0.0025878 0.1993732 -0.0431819 0.1071674 0.0243327 0.2779571 0.1808533 0.0479065 0.0359287 -0.0050233 0.2305836 0.0099577 0.0359191 0.0740629 0.3466682 0.2466364 -0.0052474 -0.0551339 0.0350653 0.3011949 -0.1101108 -0.0710489 -0.0723053 0.2238384 0.1916166 0.024441 -0.0408498 0.1845649 0.3451742 -0.0534543 -0.0980421 -0.0460825 0.1464 0.1679503 -0.0365664 0.0154582 -0.1262251 0.2825728 -0.140514 0.0315148 -0.0621473 0.255573 0.1798703 -0.0022776 0.0245925 -0.0418066 0.2510066 -0.1054917 0.0801574 -0.0259277 0.3067319 unknown
polarizability: 154.5042725|5.5787739|114.0103245|-2.3335086|18.6734915|64.0217344 unknown
InChI: InChI=1S/C5H9N7/c6-3-2(12-5(8)9)4(7)11-1-10-3/h1H,6-9H2
charge 0 multiplicity 1
21 atoms
N  -1.306756 0.439199 0.545265
N  2.290529 1.271403 0.070442
N  2.040525 -1.107107 -0.386109
N  0.425396 2.562548 0.711084
N  -0.010087 -2.221063 -0.182148
N  -3.618056 0.170075 0.344139
N  -2.263326 -0.627289 -1.410548
C  0.053675 0.222171 0.20277
C  0.94128 1.34741 0.326077
C  0.689243 -1.016071 -0.116751
C  2.753943 0.044283 -0.292221
C  -2.329424 -0.001301 -0.167855
H  3.822733 -0.025179 -0.519123
H  1.058058 3.347651 0.83894
H  -0.558081 2.600884 0.974115
H  -0.928325 -2.302954 0.249382
H  0.563453 -3.057305 -0.288236
H  -3.674623 0.622282 1.253918
H  -4.427928 0.208852 -0.270462
H  -3.069416 -1.097935 -1.814868
H  -1.348112 -0.818554 -1.813011
