program: Gaussian 09
title: 000012067
version: EM64L-G09RevD.01
frameworkgroup: C1[X(C7H6N2O4)]
method: RPBEPBE
basis: SDD
operation: Freq
keyword: #pfreq=noraman
keyword: PBEPBE/SDD
title: #p freq=noraman PBEPBE/SDD
converged: NO YES NO NO
title: Mulliken charges:
elementType: O O O O N N C C C C C C C H H H H H H
charge: -0.193748 -0.193768 -0.185169 -0.185157 0.020425 0.020395 0.524589 0.436625 0.436554 -0.526686 -0.528474 -0.501675 -0.789310 0.298942 0.299001 0.338891 0.251703 0.238373 0.238490
chargesum: 0.00000
title: Mulliken charges with hydrogens summed into heavy atoms:
elementType: O O O O N N C C C C C C C
charge: -0.193748 -0.193768 -0.185169 -0.185157 0.020425 0.020395 0.524589 0.436625 0.436554 -0.227745 -0.229473 -0.162784 -0.060745
polarizability: 1.46244932e+02 -1.96577132e-02 1.37105728e+02 3.24611070e-04 3.20636593e-01 4.45608088e+01
1716.lowfreq: -36.5599 -11.3075 -10.4077 -4.2676 -0.0007 -0.0007 -0.0007 51.4619 54.3191
frequency: -36.5080 51.4573 54.3182 126.0321 149.0807 187.9180 211.2186 223.2954 334.9360 335.8806 409.3332 454.9798 464.3962 500.3034 539.3145 571.2312 652.9856 684.9021 700.3326 725.7368 734.7489 867.2868 914.7386 926.0437 962.3210 966.0392 988.9261 1004.2079 1057.2607 1078.7840 1112.2237 1208.4598 1210.3991 1251.1838 1251.7786 1377.9693 1380.7126 1394.3566 1404.2134 1438.2666 1472.6752 1472.9608 1474.6656 1593.7044 1622.0710 2988.9904 3073.5004 3103.4164 3171.2670 3173.2597 3197.9597
redmass: 1.0128 15.9076 12.3169 6.2247 12.6423 4.7388 3.9452 3.2613 6.3835 13.1689 5.3875 8.2790 5.7699 3.8531 5.8943 4.7672 3.7709 12.2135 3.1646 8.9526 13.2778 9.4251 1.4759 4.8932 1.4876 1.3902 6.2113 1.4358 1.5969 1.3481 1.6877 14.3697 7.2830 1.2499 5.1748 11.1942 10.6735 4.1038 1.2177 4.5257 1.5733 1.1887 1.6645 6.8693 7.8397 1.0392 1.0950 1.1005 1.0918 1.0933 1.0931
irintensity: 0.9809 0.0001 0.8804 2.7379 4.6295 0.0237 0.0025 2.8917 1.4343 0.9805 0.2621 2.4218 0.0016 5.3777 0.1087 2.1718 1.3821 38.7450 34.9431 0.0001 16.9310 19.2657 12.9893 1.9292 29.3631 0.0031 0.2176 0.2114 19.8533 67.0601 20.5768 345.3415 61.3674 0.0919 34.7255 52.7616 144.9063 1.5928 21.3330 2.1646 38.1321 21.8930 47.2879 13.1836 6.0634 12.3022 12.9021 9.5355 5.8437 0.1004 21.7890
temp: 298.150 k
press: 1.00000 atm
elementType: 8 8 8 8 7 7 6 6 6 6 6 6 6 1 1 1 1 1 1
symmnumber: 1
zpe: 336461.9 jmol-1
zpe.correction: 0.128152 hartree
zpe.thermalcorrener: 0.138872 hartree
zpe.thermalcorrenthalpy: 0.139817 hartree
zpe.thermalcorrgfe: 0.090445 hartree
zpe.sumelectzpe: -679.638888 hartree
zpe.sumelectthermal: -679.628167 hartree
zpe.sumelectthermalent: -679.627223 hartree
zpe.sumelectthermalfe: -679.676595 hartree
dipole: -0.0022 5.5658 0.0679
dipole: 5.5662
quadrupole: -98.8547 -71.3619 -72.7417
quadrupole: -0.0073 -0.0069 0.2425
quadrupole: -17.8686 9.6242 8.2444 -0.0073 -0.0069 0.2425
hfenergy: -679.7670397 hartree
pointgroup: C01 [X(C7H6N2O4)]
dipole: -0.001154 2.1898309 0.0209247 debye
dipolederiv: -0.8242065 -0.1117902 0.0027089 -0.0300755 -0.5048652 0.00227 0.0011241 0.0024537 -0.2164841 -0.8241903 0.1116468 -0.0023609 0.0299347 -0.5047819 0.0018649 -0.0015796 0.0026315 -0.2164783 -0.5350555 0.1307021 0.0001837 0.0893942 -0.7621149 0.0037233 -0.0002367 0.0041812 -0.2116084 -0.5349452 -0.1306681 -0.0003053 -0.0890841 -0.7620501 0.0039137 0.0002004 0.0034376 -0.2115877 1.5258452 -0.2245051 -0.0027442 -0.2781491 1.1487363 -0.0065399 0.0002689 -0.0056666 0.1806742 1.5253873 0.2247195 0.0027333 0.2780233 1.1487538 -0.0061559 -0.00036 -0.0053526 0.1806499 -0.3703085 -0.001191 0.0000516 -0.0008691 0.5949016 0.0181218 0.0001149 0.0740276 -0.0150902 -0.3685977 0.1461477 -0.0023373 0.1582657 -0.1258265 0.002601 -0.0005889 -0.0036292 0.0824997 -0.3681189 -0.1460867 0.0021741 -0.1585138 -0.1265908 0.0024576 0.0008444 -0.0035626 0.0823716 0.0778991 -0.137251 -0.0057242 0.2152468 -0.0897943 0.0008105 -0.0106239 -0.009208 -0.102483 0.0776039 0.1374648 0.0055453 -0.2152969 -0.0901377 0.0007081 0.0106356 -0.0093323 -0.1023263 0.1623327 -0.0002552 0.0000135 0.0000773 -0.1947866 -0.0036051 0.0001353 0.001082 -0.0840203 0.0493787 0.0028767 -0.0000387 0.0009057 -0.1991583 -0.0191149 0.0000702 -0.1225344 0.0377574 0.0882744 0.0626643 0.0008628 0.0401385 0.1145955 0.0030122 -0.0029158 0.0053628 0.1627391 0.0883415 -0.0626687 -0.0008156 -0.0402501 0.1144134 0.0030513 0.0029507 0.0054075 0.162814 0.184148 0.0000031 0.0000034 0.0000122 0.141084 0.0003197 0.0000165 0.0010981 0.1889566 0.1261317 0.0002287 0.0020497 0.0001962 0.01018 -0.0396531 0.0015993 -0.0728116 -0.0699654 -0.0414572 -0.0819153 0.091482 -0.0091556 0.0439879 0.0158543 0.0662106 0.0654714 0.0770812 -0.0384627 0.0798776 -0.0934821 0.0091997 0.0434538 0.0163604 -0.067866 0.066944 0.0745 unknown
polarizability: 146.2449364|-0.0184861|137.106773|0.0051849|0.0751753|44.5597592 unknown
InChI: InChI=1S/C7H6N2O4/c1-5-2-6(8(10)11)4-7(3-5)9(12)13/h2-4H,1H3
charge 0 multiplicity 1
19 atoms
O  3.575054 -0.221381 -0.006674
O  -3.575082 -0.222521 -0.007152
O  2.447755 -2.204521 0.011822
O  -2.447168 -2.205281 0.010649
N  2.488736 -0.916992 0.001265
N  -2.488493 -0.917732 0.001874
C  -0.000266 1.954994 -0.013839
C  1.194459 -0.179803 -0.000045
C  -1.194404 -0.180125 0.000247
C  -1.216608 1.23002 -0.011837
C  1.216238 1.230423 -0.012146
C  0.000154 -0.922226 0.005983
C  -0.000692 3.470497 0.001192
H  -2.183076 1.742444 -0.020153
H  2.182544 1.74311 -0.020729
H  0.000313 -2.014367 0.012035
H  -0.009972 3.849808 1.040639
H  0.897269 3.880196 -0.490762
H  -0.89026 3.879757 -0.506271
