program: Gaussian 09
title: 000130000
version: EM64L-G09RevD.01
frameworkgroup: C1[X(C16H14O4)]
method: RPBEPBE
basis: SDD
operation: Freq
keyword: #pfreq=noraman
keyword: PBEPBE/SDD
title: #p freq=noraman PBEPBE/SDD
converged: NO YES NO YES
title: Mulliken charges:
elementType: O O O O C C C C C C C C C C C C C C C C H H H H H H H H H H H H H H
charge: -0.256213 -0.242113 -0.429318 -0.199516 0.151627 -0.504221 -0.415824 -0.409062 0.148057 -0.497514 0.173857 0.209029 -0.603539 0.283707 -0.526920 0.199780 0.279853 -0.482558 -0.424799 0.120378 0.224752 0.226785 0.212877 0.213189 0.217836 0.215684 0.234795 0.241499 0.252802 0.291028 0.279790 0.254525 0.212568 0.347176
chargesum: 0.00000
title: Mulliken charges with hydrogens summed into heavy atoms:
elementType: O O O O C C C C C C C C C C C C C C C C
charge: -0.256213 -0.242113 -0.082142 -0.199516 0.151627 -0.052683 0.010241 0.024458 0.148057 -0.021219 0.173857 0.209029 -0.350737 0.283707 -0.235892 0.199780 0.279853 -0.202767 0.042293 0.120378
polarizability: 3.27068621e+02 -6.78247016e+00 1.81609583e+02 -2.87439191e-01 1.80177188e+00 9.46200511e+01
1716.lowfreq: -9.2545 -4.1252 -0.0004 0.0004 0.0006 4.7908 44.6089 54.2906 95.2822
frequency: 44.5955 54.2842 95.2802 105.1235 110.7117 160.4343 168.7689 177.7448 192.9284 241.2328 265.4174 276.5464 295.7949 332.5620 352.5611 370.7595 375.9488 431.6752 436.3259 446.3251 477.8572 525.6939 535.7599 539.4520 573.0604 601.6825 627.4708 661.2132 669.1731 700.0613 711.3268 743.9767 758.9096 778.7295 800.4238 821.0128 845.3047 867.5059 872.2207 877.9979 894.1072 906.4569 946.2008 959.8384 965.3577 991.2343 1046.5903 1070.0096 1079.3154 1090.6848 1100.6128 1120.3639 1135.0734 1153.1894 1173.2374 1184.4511 1200.1545 1230.9278 1234.2873 1241.7478 1257.3315 1291.2311 1314.8530 1330.1886 1337.0730 1340.2751 1350.7345 1365.9010 1379.0621 1407.9062 1445.8861 1456.3727 1463.5423 1465.9342 1469.0895 1472.3567 1474.3020 1570.4862 1607.1946 1633.3717 1641.8844 1685.9353 2950.0225 2965.0355 2972.7096 2984.5670 2990.9868 3017.4037 3031.7087 3048.4005 3051.0038 3059.7902 3152.4733 3180.2802 3193.2921 3557.1037
redmass: 5.8463 4.0062 3.9739 3.7666 3.7292 3.8495 2.7629 4.1691 6.3406 7.5813 3.6423 2.7047 3.5630 3.3802 1.1893 7.3409 4.7080 3.1013 5.2052 5.0586 3.2210 4.0871 5.7841 4.9701 5.5176 4.8457 4.9095 5.0381 3.3975 5.7236 6.9653 3.5797 7.2857 6.5191 5.0664 1.5267 2.5378 1.4602 1.4633 2.8455 1.4165 1.5088 3.5423 2.3046 2.3327 2.6914 5.1542 3.0482 2.0551 3.0622 2.1510 4.9234 1.2078 1.6938 1.1538 2.6781 2.0234 1.4118 1.6539 1.4144 1.4319 1.4973 1.5302 1.4004 1.4771 1.4032 1.6330 1.9556 3.3647 6.4288 1.4885 1.1262 1.1053 1.4860 1.9736 2.1119 1.2054 9.2492 8.5487 8.4385 7.7336 10.6125 1.0673 1.0623 1.0635 1.0657 1.0627 1.0956 1.0953 1.0929 1.0989 1.1040 1.0915 1.0909 1.0940 1.0663
irintensity: 0.1772 0.8439 2.5774 2.8171 2.4613 3.4315 2.2768 2.3477 4.1139 1.7989 5.3089 1.7244 2.8934 3.2474 164.5194 3.0521 2.3374 8.5942 3.3175 4.8477 1.2807 10.2834 5.5409 9.3903 1.5659 2.7834 6.8109 3.7427 2.8406 0.2469 2.1499 0.4452 6.0891 12.0442 38.5541 4.5507 5.7919 6.2874 26.0558 76.9348 52.9899 1.3673 15.8929 15.1761 98.7663 14.7883 66.7472 37.9289 0.8635 106.1470 24.6875 19.2675 5.8220 1.6132 18.7346 14.0495 12.5702 4.8883 4.7382 1.7832 1.9584 4.4457 27.8851 4.0841 1.7167 100.0332 8.4913 9.6994 5.3060 20.9765 4.2913 3.6981 8.4513 40.9029 1.7252 74.1151 3.6461 67.4551 4.1054 22.8989 66.3065 639.7618 40.2416 27.6884 29.7079 30.8303 31.7235 32.6049 17.8463 8.9852 70.7129 54.3656 5.6900 1.1541 0.8398 18.0243
temp: 298.150 k
press: 1.00000 atm
elementType: 8 8 8 8 6 6 6 6 6 6 6 6 6 6 6 6 6 6 6 6 1 1 1 1 1 1 1 1 1 1 1 1 1 1
symmnumber: 1
zpe: 691222.5 jmol-1
zpe.correction: 0.263273 hartree
zpe.thermalcorrener: 0.279633 hartree
zpe.thermalcorrenthalpy: 0.280577 hartree
zpe.thermalcorrgfe: 0.219599 hartree
zpe.sumelectzpe: -917.575475 hartree
zpe.sumelectthermal: -917.559115 hartree
zpe.sumelectthermalent: -917.558171 hartree
zpe.sumelectthermalfe: -917.619149 hartree
dipole: -7.1139 4.5282 -1.1978
dipole: 8.5174
quadrupole: -124.9696 -122.6888 -114.6367
quadrupole: 10.7627 -6.5412 -3.9581
quadrupole: -4.2046 -1.9238 6.1284 10.7627 -6.5412 -3.9581
hfenergy: -917.838748 hartree
pointgroup: C01 [X(C16H14O4)]
dipole: -2.8138682 -1.7547743 0.4818724 debye
polarizability: 327.1641049|5.6361646|181.538524|0.7797318|0.9671332|94.5956254 unknown
InChI: InChI=1S/C16H14O4/c17-8-9-5-16(18)20-14-7-15-12(6-11(9)14)10-3-1-2-4-13(10)19-15/h5-7,17H,1-4,8H2
charge 0 multiplicity 1
34 atoms
O  -2.214202 1.841284 0.05273
O  2.653092 1.823342 0.03364
O  3.988031 -3.144398 0.088207
O  4.958565 1.831035 -0.003288
C  -2.486111 -0.467903 -0.005914
C  -3.240005 -1.776716 -0.02782
C  -4.725312 -1.541891 0.366782
C  -5.334301 -0.31027 -0.353712
C  -3.136029 0.747761 0.025609
C  -4.605589 1.010665 0.030717
C  -1.05742 -0.180076 -0.005519
C  -0.938896 1.249626 0.033702
C  0.117272 -0.954268 -0.026333
C  1.385934 -0.306662 -0.011044
C  0.276217 1.934334 0.046388
C  1.436043 1.131214 0.021992
C  2.658764 -1.023688 -0.035223
C  3.849667 -0.328672 -0.042013
C  2.66289 -2.548405 -0.044405
C  3.931344 1.1268 -0.006688
H  -2.777151 -2.506561 0.665034
H  -3.185258 -2.229643 -1.039174
H  -5.318734 -2.444695 0.130339
H  -4.790862 -1.388168 1.462314
H  -6.408179 -0.220635 -0.107295
H  -5.262885 -0.4580 -1.449143
H  -4.931803 1.356301 1.032743
H  -4.861268 1.819883 -0.679327
H  0.055089 -2.046213 -0.061128
H  0.352924 3.022815 0.072735
H  4.804571 -0.856789 -0.098553
H  2.286187 -2.919017 -1.014768
H  1.978407 -2.923912 0.746753
H  4.355507 -2.935574 0.984662
